zookeeper-dev mailing list archives

Site index · List index
Message view « Date » · « Thread »
Top « Date » · « Thread »
From Apache Jenkins Server <jenk...@builds.apache.org>
Subject ZooKeeper-trunk-openjdk7 - Build # 1692 - Still Failing
Date Wed, 08 Nov 2017 21:03:01 GMT
See https://builds.apache.org/job/ZooKeeper-trunk-openjdk7/1692/

###################################################################################
########################## LAST 60 LINES OF THE CONSOLE ###########################
[...truncated 68.24 MB...]
    [junit] 2017-11-08 21:02:26,483 [myid:127.0.0.1:30073] - WARN  [main-SendThread(127.0.0.1:30073):ClientCnxn$SendThread@1235]
- Session 0x48c5faa590000 for server 127.0.0.1/127.0.0.1:30073, unexpected error, closing
socket connection and attempting reconnect
    [junit] java.net.ConnectException: Connection refused
    [junit] 	at sun.nio.ch.SocketChannelImpl.checkConnect(Native Method)
    [junit] 	at sun.nio.ch.SocketChannelImpl.finishConnect(SocketChannelImpl.java:744)
    [junit] 	at org.apache.zookeeper.ClientCnxnSocketNIO.doTransport(ClientCnxnSocketNIO.java:357)
    [junit] 	at org.apache.zookeeper.ClientCnxn$SendThread.run(ClientCnxn.java:1214)
    [junit] 2017-11-08 21:02:26,840 [myid:127.0.0.1:30076] - INFO  [main-SendThread(127.0.0.1:30076):ClientCnxn$SendThread@1113]
- Opening socket connection to server 127.0.0.1/127.0.0.1:30076. Will not attempt to authenticate
using SASL (unknown error)
    [junit] 2017-11-08 21:02:26,841 [myid:127.0.0.1:30076] - WARN  [main-SendThread(127.0.0.1:30076):ClientCnxn$SendThread@1235]
- Session 0x1048c5facef0001 for server 127.0.0.1/127.0.0.1:30076, unexpected error, closing
socket connection and attempting reconnect
    [junit] java.net.ConnectException: Connection refused
    [junit] 	at sun.nio.ch.SocketChannelImpl.checkConnect(Native Method)
    [junit] 	at sun.nio.ch.SocketChannelImpl.finishConnect(SocketChannelImpl.java:744)
    [junit] 	at org.apache.zookeeper.ClientCnxnSocketNIO.doTransport(ClientCnxnSocketNIO.java:357)
    [junit] 	at org.apache.zookeeper.ClientCnxn$SendThread.run(ClientCnxn.java:1214)
    [junit] 2017-11-08 21:02:27,068 [myid:127.0.0.1:30076] - INFO  [main-SendThread(127.0.0.1:30076):ClientCnxn$SendThread@1113]
- Opening socket connection to server 127.0.0.1/127.0.0.1:30076. Will not attempt to authenticate
using SASL (unknown error)
    [junit] 2017-11-08 21:02:27,069 [myid:127.0.0.1:30076] - WARN  [main-SendThread(127.0.0.1:30076):ClientCnxn$SendThread@1235]
- Session 0x1048c5facef0000 for server 127.0.0.1/127.0.0.1:30076, unexpected error, closing
socket connection and attempting reconnect
    [junit] java.net.ConnectException: Connection refused
    [junit] 	at sun.nio.ch.SocketChannelImpl.checkConnect(Native Method)
    [junit] 	at sun.nio.ch.SocketChannelImpl.finishConnect(SocketChannelImpl.java:744)
    [junit] 	at org.apache.zookeeper.ClientCnxnSocketNIO.doTransport(ClientCnxnSocketNIO.java:357)
    [junit] 	at org.apache.zookeeper.ClientCnxn$SendThread.run(ClientCnxn.java:1214)
    [junit] 2017-11-08 21:02:27,739 [myid:127.0.0.1:30073] - INFO  [main-SendThread(127.0.0.1:30073):ClientCnxn$SendThread@1113]
- Opening socket connection to server 127.0.0.1/127.0.0.1:30073. Will not attempt to authenticate
using SASL (unknown error)
    [junit] 2017-11-08 21:02:27,740 [myid:127.0.0.1:30073] - WARN  [main-SendThread(127.0.0.1:30073):ClientCnxn$SendThread@1235]
- Session 0x48c5faa590000 for server 127.0.0.1/127.0.0.1:30073, unexpected error, closing
socket connection and attempting reconnect
    [junit] java.net.ConnectException: Connection refused
    [junit] 	at sun.nio.ch.SocketChannelImpl.checkConnect(Native Method)
    [junit] 	at sun.nio.ch.SocketChannelImpl.finishConnect(SocketChannelImpl.java:744)
    [junit] 	at org.apache.zookeeper.ClientCnxnSocketNIO.doTransport(ClientCnxnSocketNIO.java:357)
    [junit] 	at org.apache.zookeeper.ClientCnxn$SendThread.run(ClientCnxn.java:1214)
    [junit] 2017-11-08 21:02:27,845 [myid:127.0.0.1:30073] - INFO  [main-SendThread(127.0.0.1:30073):ClientCnxn$SendThread@1113]
- Opening socket connection to server 127.0.0.1/127.0.0.1:30073. Will not attempt to authenticate
using SASL (unknown error)
    [junit] 2017-11-08 21:02:27,845 [myid:127.0.0.1:30073] - WARN  [main-SendThread(127.0.0.1:30073):ClientCnxn$SendThread@1235]
- Session 0x48c5faa590001 for server 127.0.0.1/127.0.0.1:30073, unexpected error, closing
socket connection and attempting reconnect
    [junit] java.net.ConnectException: Connection refused
    [junit] 	at sun.nio.ch.SocketChannelImpl.checkConnect(Native Method)
    [junit] 	at sun.nio.ch.SocketChannelImpl.finishConnect(SocketChannelImpl.java:744)
    [junit] 	at org.apache.zookeeper.ClientCnxnSocketNIO.doTransport(ClientCnxnSocketNIO.java:357)
    [junit] 	at org.apache.zookeeper.ClientCnxn$SendThread.run(ClientCnxn.java:1214)
    [junit] 2017-11-08 21:02:28,001 [myid:127.0.0.1:30076] - INFO  [main-SendThread(127.0.0.1:30076):ClientCnxn$SendThread@1113]
- Opening socket connection to server 127.0.0.1/127.0.0.1:30076. Will not attempt to authenticate
using SASL (unknown error)
    [junit] 2017-11-08 21:02:28,001 [myid:127.0.0.1:30076] - WARN  [main-SendThread(127.0.0.1:30076):ClientCnxn$SendThread@1235]
- Session 0x1048c5facef0001 for server 127.0.0.1/127.0.0.1:30076, unexpected error, closing
socket connection and attempting reconnect
    [junit] java.net.ConnectException: Connection refused
    [junit] 	at sun.nio.ch.SocketChannelImpl.checkConnect(Native Method)
    [junit] 	at sun.nio.ch.SocketChannelImpl.finishConnect(SocketChannelImpl.java:744)
    [junit] 	at org.apache.zookeeper.ClientCnxnSocketNIO.doTransport(ClientCnxnSocketNIO.java:357)
    [junit] 	at org.apache.zookeeper.ClientCnxn$SendThread.run(ClientCnxn.java:1214)
    [junit] Running org.apache.zookeeper.server.quorum.StandaloneDisabledTest in thread 8
    [junit] Tests run: 1, Failures: 0, Errors: 1, Skipped: 0, Time elapsed: 0 sec, Thread:
8, Class: org.apache.zookeeper.server.quorum.StandaloneDisabledTest
    [junit] Test org.apache.zookeeper.server.quorum.StandaloneDisabledTest FAILED (timeout)
    [junit] Running org.apache.zookeeper.server.quorum.Zab1_0Test in thread 1
    [junit] Tests run: 1, Failures: 0, Errors: 1, Skipped: 0, Time elapsed: 0 sec, Thread:
1, Class: org.apache.zookeeper.server.quorum.Zab1_0Test
    [junit] Test org.apache.zookeeper.server.quorum.Zab1_0Test FAILED (timeout)

fail.build.on.test.failure:

BUILD FAILED
/home/jenkins/jenkins-slave/workspace/ZooKeeper-trunk-openjdk7/build.xml:1267: The following
error occurred while executing this line:
/home/jenkins/jenkins-slave/workspace/ZooKeeper-trunk-openjdk7/build.xml:1271: Tests failed!

Total time: 16 minutes 51 seconds
Build step 'Invoke Ant' marked build as failure
Recording test results
Email was triggered for: Failure - Any
Sending email for trigger: Failure - Any



###################################################################################
############################## FAILED TESTS (if any) ##############################
3 tests failed.
FAILED:  org.apache.zookeeper.server.quorum.CommitProcessorConcurrencyTest.noStarvationOfNonLocalCommittedRequestsTest

Error Message:
test timed out after 1000 milliseconds

Stack Trace:
org.junit.runners.model.TestTimedOutException: test timed out after 1000 milliseconds
	at java.lang.System.arraycopy(Native Method)
	at java.io.ByteArrayOutputStream.write(ByteArrayOutputStream.java:154)
	at java.io.DataOutputStream.write(DataOutputStream.java:107)
	at org.apache.jute.BinaryOutputArchive.writeString(BinaryOutputArchive.java:109)
	at org.apache.zookeeper.proto.GetDataRequest.serialize(GetDataRequest.java:50)
	at org.apache.zookeeper.server.quorum.CommitProcessorConcurrencyTest.newRequest(CommitProcessorConcurrencyTest.java:127)
	at org.apache.zookeeper.server.quorum.CommitProcessorConcurrencyTest.access$000(CommitProcessorConcurrencyTest.java:53)
	at org.apache.zookeeper.server.quorum.CommitProcessorConcurrencyTest$MockRequestsQueue.poll(CommitProcessorConcurrencyTest.java:82)
	at org.apache.zookeeper.server.quorum.CommitProcessorConcurrencyTest$MockRequestsQueue.poll(CommitProcessorConcurrencyTest.java:74)
	at org.apache.zookeeper.server.quorum.CommitProcessor.run(CommitProcessor.java:198)
	at org.apache.zookeeper.server.quorum.CommitProcessorConcurrencyTest.noStarvationOfNonLocalCommittedRequestsTest(CommitProcessorConcurrencyTest.java:300)
	at org.apache.zookeeper.JUnit4ZKTestRunner$LoggedInvokeMethod.evaluate(JUnit4ZKTestRunner.java:79)
	at java.util.concurrent.FutureTask.run(FutureTask.java:262)
	at java.lang.Thread.run(Thread.java:748)


FAILED:  org.apache.zookeeper.server.quorum.StandaloneDisabledTest.startSingleServerTest

Error Message:
Timeout occurred. Please note the time in the report does not reflect the time until the timeout.

Stack Trace:
junit.framework.AssertionFailedError: Timeout occurred. Please note the time in the report
does not reflect the time until the timeout.
	at java.lang.Thread.run(Thread.java:748)


FAILED:  org.apache.zookeeper.server.quorum.Zab1_0Test.testNormalObserverRun

Error Message:
Timeout occurred. Please note the time in the report does not reflect the time until the timeout.

Stack Trace:
junit.framework.AssertionFailedError: Timeout occurred. Please note the time in the report
does not reflect the time until the timeout.
	at java.lang.Thread.run(Thread.java:748)
Mime
  • Unnamed multipart/mixed (inline, None, 0 bytes)
View raw message