zookeeper-dev mailing list archives

Site index · List index
Message view « Date » · « Thread »
Top « Date » · « Thread »
From Apache Jenkins Server <jenk...@builds.apache.org>
Subject ZooKeeper_branch35_openjdk7 - Build # 754 - Still Failing
Date Wed, 22 Nov 2017 23:55:36 GMT
See https://builds.apache.org/job/ZooKeeper_branch35_openjdk7/754/

###################################################################################
########################## LAST 60 LINES OF THE CONSOLE ###########################
[...truncated 62.92 MB...]
    [junit] 2017-11-22 23:54:48,982 [myid:] - INFO  [main:FourLetterWordMain@87] - connecting
to 127.0.0.1 11468
    [junit] 2017-11-22 23:54:48,982 [myid:] - INFO  [main:JMXEnv@146] - ensureOnly:[]
    [junit] 2017-11-22 23:54:48,990 [myid:] - INFO  [main:ClientBase@611] - fdcount after
test is: 1413 at start it was 1413
    [junit] 2017-11-22 23:54:48,990 [myid:] - INFO  [main:ZKTestCase$1@68] - SUCCEEDED testWatcherAutoResetWithLocal
    [junit] 2017-11-22 23:54:48,990 [myid:] - INFO  [main:ZKTestCase$1@63] - FINISHED testWatcherAutoResetWithLocal
    [junit] 2017-11-22 23:54:49,341 [myid:127.0.0.1:11348] - INFO  [main-SendThread(127.0.0.1:11348):ClientCnxn$SendThread@1113]
- Opening socket connection to server 127.0.0.1/127.0.0.1:11348. Will not attempt to authenticate
using SASL (unknown error)
    [junit] 2017-11-22 23:54:49,342 [myid:127.0.0.1:11348] - WARN  [main-SendThread(127.0.0.1:11348):ClientCnxn$SendThread@1235]
- Session 0x204d520cb980000 for server 127.0.0.1/127.0.0.1:11348, unexpected error, closing
socket connection and attempting reconnect
    [junit] java.net.ConnectException: Connection refused
    [junit] 	at sun.nio.ch.SocketChannelImpl.checkConnect(Native Method)
    [junit] 	at sun.nio.ch.SocketChannelImpl.finishConnect(SocketChannelImpl.java:744)
    [junit] 	at org.apache.zookeeper.ClientCnxnSocketNIO.doTransport(ClientCnxnSocketNIO.java:357)
    [junit] 	at org.apache.zookeeper.ClientCnxn$SendThread.run(ClientCnxn.java:1214)
    [junit] Tests run: 103, Failures: 0, Errors: 0, Skipped: 0, Time elapsed: 543.783 sec,
Thread: 1, Class: org.apache.zookeeper.test.NioNettySuiteTest
    [junit] 2017-11-22 23:54:49,359 [myid:] - INFO  [SessionTracker:SessionTrackerImpl@158]
- SessionTrackerImpl exited loop!
    [junit] 2017-11-22 23:54:49,360 [myid:] - INFO  [SessionTracker:SessionTrackerImpl@158]
- SessionTrackerImpl exited loop!
    [junit] 2017-11-22 23:54:49,360 [myid:127.0.0.1:11286] - INFO  [main-SendThread(127.0.0.1:11286):ClientCnxn$SendThread@1113]
- Opening socket connection to server 127.0.0.1/127.0.0.1:11286. Will not attempt to authenticate
using SASL (unknown error)
    [junit] 2017-11-22 23:54:49,360 [myid:127.0.0.1:11286] - WARN  [main-SendThread(127.0.0.1:11286):ClientCnxn$SendThread@1235]
- Session 0x104d51d0d890000 for server 127.0.0.1/127.0.0.1:11286, unexpected error, closing
socket connection and attempting reconnect
    [junit] java.net.ConnectException: Connection refused
    [junit] 	at sun.nio.ch.SocketChannelImpl.checkConnect(Native Method)
    [junit] 	at sun.nio.ch.SocketChannelImpl.finishConnect(SocketChannelImpl.java:744)
    [junit] 	at org.apache.zookeeper.ClientCnxnSocketNIO.doTransport(ClientCnxnSocketNIO.java:357)
    [junit] 	at org.apache.zookeeper.ClientCnxn$SendThread.run(ClientCnxn.java:1214)
    [junit] 2017-11-22 23:54:49,359 [myid:127.0.0.1:11345] - INFO  [main-SendThread(127.0.0.1:11345):ClientCnxn$SendThread@1113]
- Opening socket connection to server 127.0.0.1/127.0.0.1:11345. Will not attempt to authenticate
using SASL (unknown error)
    [junit] 2017-11-22 23:54:49,361 [myid:127.0.0.1:11345] - WARN  [main-SendThread(127.0.0.1:11345):ClientCnxn$SendThread@1235]
- Session 0x104d520cba30000 for server 127.0.0.1/127.0.0.1:11345, unexpected error, closing
socket connection and attempting reconnect
    [junit] java.net.ConnectException: Connection refused
    [junit] 	at sun.nio.ch.SocketChannelImpl.checkConnect(Native Method)
    [junit] 	at sun.nio.ch.SocketChannelImpl.finishConnect(SocketChannelImpl.java:744)
    [junit] 	at org.apache.zookeeper.ClientCnxnSocketNIO.doTransport(ClientCnxnSocketNIO.java:357)
    [junit] 	at org.apache.zookeeper.ClientCnxn$SendThread.run(ClientCnxn.java:1214)
    [junit] 2017-11-22 23:54:49,744 [myid:127.0.0.1:11271] - INFO  [main-SendThread(127.0.0.1:11271):ClientCnxn$SendThread@1113]
- Opening socket connection to server 127.0.0.1/127.0.0.1:11271. Will not attempt to authenticate
using SASL (unknown error)
    [junit] 2017-11-22 23:54:49,744 [myid:127.0.0.1:11271] - WARN  [main-SendThread(127.0.0.1:11271):ClientCnxn$SendThread@1235]
- Session 0x104d51ca6310001 for server 127.0.0.1/127.0.0.1:11271, unexpected error, closing
socket connection and attempting reconnect
    [junit] java.net.ConnectException: Connection refused
    [junit] 	at sun.nio.ch.SocketChannelImpl.checkConnect(Native Method)
    [junit] 	at sun.nio.ch.SocketChannelImpl.finishConnect(SocketChannelImpl.java:744)
    [junit] 	at org.apache.zookeeper.ClientCnxnSocketNIO.doTransport(ClientCnxnSocketNIO.java:357)
    [junit] 	at org.apache.zookeeper.ClientCnxn$SendThread.run(ClientCnxn.java:1214)
    [junit] 2017-11-22 23:54:50,362 [myid:127.0.0.1:11351] - INFO  [main-SendThread(127.0.0.1:11351):ClientCnxn$SendThread@1113]
- Opening socket connection to server 127.0.0.1/127.0.0.1:11351. Will not attempt to authenticate
using SASL (unknown error)
    [junit] 2017-11-22 23:54:50,363 [myid:127.0.0.1:11351] - WARN  [main-SendThread(127.0.0.1:11351):ClientCnxn$SendThread@1235]
- Session 0x304d520cb9c0000 for server 127.0.0.1/127.0.0.1:11351, unexpected error, closing
socket connection and attempting reconnect
    [junit] java.net.ConnectException: Connection refused
    [junit] 	at sun.nio.ch.SocketChannelImpl.checkConnect(Native Method)
    [junit] 	at sun.nio.ch.SocketChannelImpl.finishConnect(SocketChannelImpl.java:744)
    [junit] 	at org.apache.zookeeper.ClientCnxnSocketNIO.doTransport(ClientCnxnSocketNIO.java:357)
    [junit] 	at org.apache.zookeeper.ClientCnxn$SendThread.run(ClientCnxn.java:1214)

fail.build.on.test.failure:

BUILD FAILED
/home/jenkins/jenkins-slave/workspace/ZooKeeper_branch35_openjdk7/build.xml:1272: The following
error occurred while executing this line:
/home/jenkins/jenkins-slave/workspace/ZooKeeper_branch35_openjdk7/build.xml:1276: Tests failed!

Total time: 15 minutes 6 seconds
Build step 'Invoke Ant' marked build as failure
Recording test results
Setting OPENJDK_7_ON_UBUNTU_ONLY__HOME=/usr/lib/jvm/java-7-openjdk-amd64/
Setting OPENJDK_7_ON_UBUNTU_ONLY__HOME=/usr/lib/jvm/java-7-openjdk-amd64/
Email was triggered for: Failure - Any
Sending email for trigger: Failure - Any
Setting OPENJDK_7_ON_UBUNTU_ONLY__HOME=/usr/lib/jvm/java-7-openjdk-amd64/
Setting OPENJDK_7_ON_UBUNTU_ONLY__HOME=/usr/lib/jvm/java-7-openjdk-amd64/



###################################################################################
############################## FAILED TESTS (if any) ##############################
2 tests failed.
FAILED:  org.apache.zookeeper.test.LETest.testLE

Error Message:
Threads didn't join

Stack Trace:
junit.framework.AssertionFailedError: Threads didn't join
	at org.apache.zookeeper.test.LETest.testLE(LETest.java:123)
	at org.apache.zookeeper.JUnit4ZKTestRunner$LoggedInvokeMethod.evaluate(JUnit4ZKTestRunner.java:79)


FAILED:  org.apache.zookeeper.test.QuorumZxidSyncTest.testBehindLeader

Error Message:
Servers didn't come up

Stack Trace:
junit.framework.AssertionFailedError: Servers didn't come up
	at org.apache.zookeeper.test.QuorumZxidSyncTest.testBehindLeader(QuorumZxidSyncTest.java:87)
	at org.apache.zookeeper.JUnit4ZKTestRunner$LoggedInvokeMethod.evaluate(JUnit4ZKTestRunner.java:79)
Mime
  • Unnamed multipart/mixed (inline, None, 0 bytes)
View raw message