zookeeper-dev mailing list archives

Site index · List index
Message view « Date » · « Thread »
Top « Date » · « Thread »
From Apache Jenkins Server <jenk...@builds.apache.org>
Subject ZooKeeper-trunk-openjdk7 - Build # 1706 - Failure
Date Tue, 21 Nov 2017 20:09:53 GMT
See https://builds.apache.org/job/ZooKeeper-trunk-openjdk7/1706/

###################################################################################
########################## LAST 60 LINES OF THE CONSOLE ###########################
[...truncated 65.09 MB...]
    [junit] java.net.ConnectException: Connection refused
    [junit] 	at sun.nio.ch.SocketChannelImpl.checkConnect(Native Method)
    [junit] 	at sun.nio.ch.SocketChannelImpl.finishConnect(SocketChannelImpl.java:744)
    [junit] 	at org.apache.zookeeper.ClientCnxnSocketNIO.doTransport(ClientCnxnSocketNIO.java:357)
    [junit] 	at org.apache.zookeeper.ClientCnxn$SendThread.run(ClientCnxn.java:1214)
    [junit] 2017-11-21 20:03:38,120 [myid:] - INFO  [ProcessThread(sid:0 cport:27626)::PrepRequestProcessor@614]
- Processed session termination for sessionid: 0x104cf2a15e30000
    [junit] 2017-11-21 20:03:38,123 [myid:] - INFO  [SyncThread:0:MBeanRegistry@128] - Unregister
MBean [org.apache.ZooKeeperService:name0=StandaloneServer_port27626,name1=Connections,name2=127.0.0.1,name3=0x104cf2a15e30000]
    [junit] 2017-11-21 20:03:38,123 [myid:] - INFO  [main:ZooKeeper@1332] - Session: 0x104cf2a15e30000
closed
    [junit] 2017-11-21 20:03:38,123 [myid:] - INFO  [main:JUnit4ZKTestRunner$LoggedInvokeMethod@82]
- Memory used 153812
    [junit] 2017-11-21 20:03:38,124 [myid:] - INFO  [main:JUnit4ZKTestRunner$LoggedInvokeMethod@87]
- Number of threads 472
    [junit] 2017-11-21 20:03:38,124 [myid:] - INFO  [main:JUnit4ZKTestRunner$LoggedInvokeMethod@102]
- FINISHED TEST METHOD testWatcherAutoResetWithLocal
    [junit] 2017-11-21 20:03:38,124 [myid:] - INFO  [main:ClientBase@601] - tearDown starting
    [junit] 2017-11-21 20:03:38,124 [myid:] - INFO  [main:ClientBase@571] - STOPPING server
    [junit] 2017-11-21 20:03:38,124 [myid:] - INFO  [main:NettyServerCnxnFactory@464] - shutdown
called 0.0.0.0/0.0.0.0:27626
    [junit] 2017-11-21 20:03:38,123 [myid:] - INFO  [main-EventThread:ClientCnxn$EventThread@513]
- EventThread shut down for session: 0x104cf2a15e30000
    [junit] 2017-11-21 20:03:38,128 [myid:] - INFO  [main:ZooKeeperServer@545] - shutting
down
    [junit] 2017-11-21 20:03:38,128 [myid:] - INFO  [main:SessionTrackerImpl@232] - Shutting
down
    [junit] 2017-11-21 20:03:38,128 [myid:] - INFO  [main:PrepRequestProcessor@1010] - Shutting
down
    [junit] 2017-11-21 20:03:38,128 [myid:] - INFO  [ProcessThread(sid:0 cport:27626)::PrepRequestProcessor@155]
- PrepRequestProcessor exited loop!
    [junit] 2017-11-21 20:03:38,129 [myid:] - INFO  [main:SyncRequestProcessor@191] - Shutting
down
    [junit] 2017-11-21 20:03:38,129 [myid:] - INFO  [SyncThread:0:SyncRequestProcessor@169]
- SyncRequestProcessor exited!
    [junit] 2017-11-21 20:03:38,129 [myid:] - INFO  [main:FinalRequestProcessor@481] - shutdown
of request processor complete
    [junit] 2017-11-21 20:03:38,130 [myid:] - INFO  [main:MBeanRegistry@128] - Unregister
MBean [org.apache.ZooKeeperService:name0=StandaloneServer_port27626,name1=InMemoryDataTree]
    [junit] 2017-11-21 20:03:38,130 [myid:] - INFO  [main:MBeanRegistry@128] - Unregister
MBean [org.apache.ZooKeeperService:name0=StandaloneServer_port27626]
    [junit] 2017-11-21 20:03:38,130 [myid:] - INFO  [main:FourLetterWordMain@87] - connecting
to 127.0.0.1 27626
    [junit] 2017-11-21 20:03:38,131 [myid:] - INFO  [main:JMXEnv@146] - ensureOnly:[]
    [junit] 2017-11-21 20:03:38,137 [myid:] - INFO  [main:ClientBase@626] - fdcount after
test is: 1409 at start it was 1409
    [junit] 2017-11-21 20:03:38,138 [myid:] - INFO  [main:ZKTestCase$1@68] - SUCCEEDED testWatcherAutoResetWithLocal
    [junit] 2017-11-21 20:03:38,138 [myid:] - INFO  [main:ZKTestCase$1@63] - FINISHED testWatcherAutoResetWithLocal
    [junit] Tests run: 105, Failures: 0, Errors: 0, Skipped: 0, Time elapsed: 387.447 sec,
Thread: 7, Class: org.apache.zookeeper.test.NioNettySuiteTest
    [junit] 2017-11-21 20:03:38,743 [myid:127.0.0.1:27506] - INFO  [main-SendThread(127.0.0.1:27506):ClientCnxn$SendThread@1113]
- Opening socket connection to server 127.0.0.1/127.0.0.1:27506. Will not attempt to authenticate
using SASL (unknown error)
    [junit] 2017-11-21 20:03:38,744 [myid:127.0.0.1:27506] - WARN  [main-SendThread(127.0.0.1:27506):ClientCnxn$SendThread@1235]
- Session 0x204cf2714c50000 for server 127.0.0.1/127.0.0.1:27506, unexpected error, closing
socket connection and attempting reconnect
    [junit] java.net.ConnectException: Connection refused
    [junit] 	at sun.nio.ch.SocketChannelImpl.checkConnect(Native Method)
    [junit] 	at sun.nio.ch.SocketChannelImpl.finishConnect(SocketChannelImpl.java:744)
    [junit] 	at org.apache.zookeeper.ClientCnxnSocketNIO.doTransport(ClientCnxnSocketNIO.java:357)
    [junit] 	at org.apache.zookeeper.ClientCnxn$SendThread.run(ClientCnxn.java:1214)
    [junit] 2017-11-21 20:03:38,939 [myid:127.0.0.1:27503] - INFO  [main-SendThread(127.0.0.1:27503):ClientCnxn$SendThread@1113]
- Opening socket connection to server 127.0.0.1/127.0.0.1:27503. Will not attempt to authenticate
using SASL (unknown error)
    [junit] 2017-11-21 20:03:38,940 [myid:127.0.0.1:27503] - WARN  [main-SendThread(127.0.0.1:27503):ClientCnxn$SendThread@1235]
- Session 0x104cf2718950000 for server 127.0.0.1/127.0.0.1:27503, unexpected error, closing
socket connection and attempting reconnect
    [junit] java.net.ConnectException: Connection refused
    [junit] 	at sun.nio.ch.SocketChannelImpl.checkConnect(Native Method)
    [junit] 	at sun.nio.ch.SocketChannelImpl.finishConnect(SocketChannelImpl.java:744)
    [junit] 	at org.apache.zookeeper.ClientCnxnSocketNIO.doTransport(ClientCnxnSocketNIO.java:357)
    [junit] 	at org.apache.zookeeper.ClientCnxn$SendThread.run(ClientCnxn.java:1214)
    [junit] Running org.apache.zookeeper.server.quorum.Zab1_0Test in thread 1
    [junit] Tests run: 1, Failures: 0, Errors: 1, Skipped: 0, Time elapsed: 0 sec, Thread:
1, Class: org.apache.zookeeper.server.quorum.Zab1_0Test
    [junit] Test org.apache.zookeeper.server.quorum.Zab1_0Test FAILED (timeout)

fail.build.on.test.failure:

BUILD FAILED
/home/jenkins/jenkins-slave/workspace/ZooKeeper-trunk-openjdk7/build.xml:1267: The following
error occurred while executing this line:
/home/jenkins/jenkins-slave/workspace/ZooKeeper-trunk-openjdk7/build.xml:1271: Tests failed!

Total time: 17 minutes 6 seconds
Build step 'Invoke Ant' marked build as failure
Recording test results
Email was triggered for: Failure - Any
Sending email for trigger: Failure - Any



###################################################################################
############################## FAILED TESTS (if any) ##############################
4 tests failed.
FAILED:  org.apache.zookeeper.server.quorum.CommitProcessorConcurrencyTest.noStarvationOfNonLocalCommittedRequestsTest

Error Message:
test timed out after 1000 milliseconds

Stack Trace:
org.junit.runners.model.TestTimedOutException: test timed out after 1000 milliseconds
	at java.io.ByteArrayOutputStream.<init>(ByteArrayOutputStream.java:77)
	at java.io.ByteArrayOutputStream.<init>(ByteArrayOutputStream.java:62)
	at org.apache.zookeeper.server.quorum.CommitProcessorConcurrencyTest.newRequest(CommitProcessorConcurrencyTest.java:125)
	at org.apache.zookeeper.server.quorum.CommitProcessorConcurrencyTest.access$000(CommitProcessorConcurrencyTest.java:53)
	at org.apache.zookeeper.server.quorum.CommitProcessorConcurrencyTest$MockRequestsQueue.poll(CommitProcessorConcurrencyTest.java:82)
	at org.apache.zookeeper.server.quorum.CommitProcessorConcurrencyTest$MockRequestsQueue.poll(CommitProcessorConcurrencyTest.java:74)
	at org.apache.zookeeper.server.quorum.CommitProcessor.run(CommitProcessor.java:197)
	at org.apache.zookeeper.server.quorum.CommitProcessorConcurrencyTest.noStarvationOfNonLocalCommittedRequestsTest(CommitProcessorConcurrencyTest.java:300)
	at org.apache.zookeeper.JUnit4ZKTestRunner$LoggedInvokeMethod.evaluate(JUnit4ZKTestRunner.java:79)
	at java.util.concurrent.FutureTask.run(FutureTask.java:262)
	at java.lang.Thread.run(Thread.java:748)


FAILED:  org.apache.zookeeper.server.quorum.RaceConditionTest.testRaceConditionBetweenLeaderAndAckRequestProcessor

Error Message:
Leader failed to transition to new state. Current state is leading

Stack Trace:
junit.framework.AssertionFailedError: Leader failed to transition to new state. Current state
is leading
	at org.apache.zookeeper.server.quorum.RaceConditionTest.testRaceConditionBetweenLeaderAndAckRequestProcessor(RaceConditionTest.java:82)
	at org.apache.zookeeper.JUnit4ZKTestRunner$LoggedInvokeMethod.evaluate(JUnit4ZKTestRunner.java:79)
	at java.util.concurrent.FutureTask.run(FutureTask.java:262)
	at java.lang.Thread.run(Thread.java:748)


FAILED:  org.apache.zookeeper.server.quorum.Zab1_0Test.testNormalObserverRun

Error Message:
Timeout occurred. Please note the time in the report does not reflect the time until the timeout.

Stack Trace:
junit.framework.AssertionFailedError: Timeout occurred. Please note the time in the report
does not reflect the time until the timeout.
	at java.lang.Thread.run(Thread.java:748)


FAILED:  org.apache.zookeeper.test.WatchEventWhenAutoResetTest.testNodeDataChanged

Error Message:
expected:<NodeDataChanged> but was:<NodeDeleted>

Stack Trace:
junit.framework.AssertionFailedError: expected:<NodeDataChanged> but was:<NodeDeleted>
	at org.apache.zookeeper.test.WatchEventWhenAutoResetTest$EventsWatcher.assertEvent(WatchEventWhenAutoResetTest.java:67)
	at org.apache.zookeeper.test.WatchEventWhenAutoResetTest.testNodeDataChanged(WatchEventWhenAutoResetTest.java:126)
	at org.apache.zookeeper.JUnit4ZKTestRunner$LoggedInvokeMethod.evaluate(JUnit4ZKTestRunner.java:79)
Mime
  • Unnamed multipart/mixed (inline, None, 0 bytes)
View raw message