zookeeper-dev mailing list archives

Site index · List index
Message view « Date » · « Thread »
Top « Date » · « Thread »
From Apache Jenkins Server <jenk...@builds.apache.org>
Subject ZooKeeper_branch34_openjdk7 - Build # 1714 - Failure
Date Sun, 12 Nov 2017 15:15:15 GMT
See https://builds.apache.org/job/ZooKeeper_branch34_openjdk7/1714/

###################################################################################
########################## LAST 60 LINES OF THE CONSOLE ###########################
[...truncated 32.93 MB...]
    [junit] 2017-11-12 15:15:13,939 [myid:] - INFO  [main:FinalRequestProcessor@403] - shutdown
of request processor complete
    [junit] 2017-11-12 15:15:13,940 [myid:] - INFO  [main:FourLetterWordMain@65] - connecting
to 127.0.0.1 11221
    [junit] 2017-11-12 15:15:13,940 [myid:] - INFO  [main:JMXEnv@147] - ensureOnly:[]
    [junit] 2017-11-12 15:15:13,941 [myid:] - INFO  [main:ClientBase@489] - STARTING server
    [junit] 2017-11-12 15:15:13,941 [myid:] - INFO  [main:ClientBase@410] - CREATING server
instance 127.0.0.1:11221
    [junit] 2017-11-12 15:15:13,942 [myid:] - INFO  [main:ServerCnxnFactory@117] - Using org.apache.zookeeper.server.NIOServerCnxnFactory
as server connection factory
    [junit] 2017-11-12 15:15:13,942 [myid:] - INFO  [main:NIOServerCnxnFactory@89] - binding
to port 0.0.0.0/0.0.0.0:11221
    [junit] 2017-11-12 15:15:13,942 [myid:] - INFO  [main:ClientBase@385] - STARTING server
instance 127.0.0.1:11221
    [junit] 2017-11-12 15:15:13,942 [myid:] - INFO  [main:ZooKeeperServer@173] - Created server
with tickTime 3000 minSessionTimeout 6000 maxSessionTimeout 60000 datadir /home/jenkins/jenkins-slave/workspace/ZooKeeper_branch34_openjdk7/build/test/tmp/test2950548210910691824.junit.dir/version-2
snapdir /home/jenkins/jenkins-slave/workspace/ZooKeeper_branch34_openjdk7/build/test/tmp/test2950548210910691824.junit.dir/version-2
    [junit] 2017-11-12 15:15:13,945 [myid:] - ERROR [main:ZooKeeperServer@468] - ZKShutdownHandler
is not registered, so ZooKeeper server won't take any action on ERROR or SHUTDOWN server state
changes
    [junit] 2017-11-12 15:15:13,945 [myid:] - INFO  [main:FourLetterWordMain@65] - connecting
to 127.0.0.1 11221
    [junit] 2017-11-12 15:15:13,945 [myid:] - INFO  [NIOServerCxn.Factory:0.0.0.0/0.0.0.0:11221:NIOServerCnxnFactory@215]
- Accepted socket connection from /127.0.0.1:33140
    [junit] 2017-11-12 15:15:13,946 [myid:] - INFO  [NIOServerCxn.Factory:0.0.0.0/0.0.0.0:11221:NIOServerCnxn@892]
- Processing stat command from /127.0.0.1:33140
    [junit] 2017-11-12 15:15:13,946 [myid:] - INFO  [Thread-4:NIOServerCnxn$StatCommand@683]
- Stat command output
    [junit] 2017-11-12 15:15:13,946 [myid:] - INFO  [Thread-4:NIOServerCnxn@1040] - Closed
socket connection for client /127.0.0.1:33140 (no session established for client)
    [junit] 2017-11-12 15:15:13,947 [myid:] - INFO  [main:JMXEnv@230] - ensureParent:[InMemoryDataTree,
StandaloneServer_port]
    [junit] 2017-11-12 15:15:13,948 [myid:] - INFO  [main:JMXEnv@247] - expect:InMemoryDataTree
    [junit] 2017-11-12 15:15:13,948 [myid:] - INFO  [main:JMXEnv@251] - found:InMemoryDataTree
org.apache.ZooKeeperService:name0=StandaloneServer_port11221,name1=InMemoryDataTree
    [junit] 2017-11-12 15:15:13,948 [myid:] - INFO  [main:JMXEnv@247] - expect:StandaloneServer_port
    [junit] 2017-11-12 15:15:13,948 [myid:] - INFO  [main:JMXEnv@251] - found:StandaloneServer_port
org.apache.ZooKeeperService:name0=StandaloneServer_port11221
    [junit] 2017-11-12 15:15:13,949 [myid:] - INFO  [main:JUnit4ZKTestRunner$LoggedInvokeMethod@58]
- Memory used 20139
    [junit] 2017-11-12 15:15:13,949 [myid:] - INFO  [main:JUnit4ZKTestRunner$LoggedInvokeMethod@63]
- Number of threads 20
    [junit] 2017-11-12 15:15:13,949 [myid:] - INFO  [main:JUnit4ZKTestRunner$LoggedInvokeMethod@78]
- FINISHED TEST METHOD testQuota
    [junit] 2017-11-12 15:15:13,949 [myid:] - INFO  [main:ClientBase@566] - tearDown starting
    [junit] 2017-11-12 15:15:14,028 [myid:] - INFO  [main:ZooKeeper@687] - Session: 0x1056d294f770000
closed
    [junit] 2017-11-12 15:15:14,028 [myid:] - INFO  [main:ClientBase@536] - STOPPING server
    [junit] 2017-11-12 15:15:14,028 [myid:] - INFO  [main-EventThread:ClientCnxn$EventThread@520]
- EventThread shut down for session: 0x1056d294f770000
    [junit] 2017-11-12 15:15:14,028 [myid:] - INFO  [NIOServerCxn.Factory:0.0.0.0/0.0.0.0:11221:NIOServerCnxnFactory@242]
- NIOServerCnxn factory exited run method
    [junit] 2017-11-12 15:15:14,029 [myid:] - INFO  [main:ZooKeeperServer@501] - shutting
down
    [junit] 2017-11-12 15:15:14,029 [myid:] - ERROR [main:ZooKeeperServer@468] - ZKShutdownHandler
is not registered, so ZooKeeper server won't take any action on ERROR or SHUTDOWN server state
changes
    [junit] 2017-11-12 15:15:14,029 [myid:] - INFO  [main:SessionTrackerImpl@226] - Shutting
down
    [junit] 2017-11-12 15:15:14,029 [myid:] - INFO  [main:PrepRequestProcessor@769] - Shutting
down
    [junit] 2017-11-12 15:15:14,029 [myid:] - INFO  [main:SyncRequestProcessor@208] - Shutting
down
    [junit] 2017-11-12 15:15:14,029 [myid:] - INFO  [ProcessThread(sid:0 cport:11221)::PrepRequestProcessor@144]
- PrepRequestProcessor exited loop!
    [junit] 2017-11-12 15:15:14,029 [myid:] - INFO  [SyncThread:0:SyncRequestProcessor@186]
- SyncRequestProcessor exited!
    [junit] 2017-11-12 15:15:14,030 [myid:] - INFO  [main:FinalRequestProcessor@403] - shutdown
of request processor complete
    [junit] 2017-11-12 15:15:14,030 [myid:] - INFO  [main:FourLetterWordMain@65] - connecting
to 127.0.0.1 11221
    [junit] 2017-11-12 15:15:14,030 [myid:] - INFO  [main:JMXEnv@147] - ensureOnly:[]
    [junit] 2017-11-12 15:15:14,033 [myid:] - INFO  [main:ClientBase@591] - fdcount after
test is: 98 at start it was 86
    [junit] 2017-11-12 15:15:14,033 [myid:] - INFO  [main:ClientBase@593] - sleeping for 20
secs
    [junit] 2017-11-12 15:15:14,034 [myid:] - INFO  [main:ZKTestCase$1@69] - SUCCEEDED testQuota
    [junit] 2017-11-12 15:15:14,034 [myid:] - INFO  [main:ZKTestCase$1@64] - FINISHED testQuota
    [junit] Tests run: 1, Failures: 0, Errors: 0, Skipped: 0, Time elapsed: 0.624 sec

fail.build.on.test.failure:

BUILD FAILED
/home/jenkins/jenkins-slave/workspace/ZooKeeper_branch34_openjdk7/build.xml:1382: The following
error occurred while executing this line:
/home/jenkins/jenkins-slave/workspace/ZooKeeper_branch34_openjdk7/build.xml:1385: Tests failed!

Total time: 32 minutes 1 second
Build step 'Invoke Ant' marked build as failure
Recording test results
Setting OPENJDK_7_ON_UBUNTU_ONLY__HOME=/usr/lib/jvm/java-7-openjdk-amd64/
Setting OPENJDK_7_ON_UBUNTU_ONLY__HOME=/usr/lib/jvm/java-7-openjdk-amd64/
Email was triggered for: Failure - Any
Sending email for trigger: Failure - Any
Setting OPENJDK_7_ON_UBUNTU_ONLY__HOME=/usr/lib/jvm/java-7-openjdk-amd64/
Setting OPENJDK_7_ON_UBUNTU_ONLY__HOME=/usr/lib/jvm/java-7-openjdk-amd64/



###################################################################################
############################## FAILED TESTS (if any) ##############################
1 tests failed.
FAILED:  org.apache.zookeeper.SaslAuthTest.testZKOperationsAfterClientSaslAuthFailure

Error Message:
Did not connect

Stack Trace:
java.util.concurrent.TimeoutException: Did not connect
	at org.apache.zookeeper.test.ClientBase$CountdownWatcher.waitForConnected(ClientBase.java:151)
	at org.apache.zookeeper.SaslAuthTest.testZKOperationsAfterClientSaslAuthFailure(SaslAuthTest.java:174)
	at org.apache.zookeeper.JUnit4ZKTestRunner$LoggedInvokeMethod.evaluate(JUnit4ZKTestRunner.java:55)
Mime
  • Unnamed multipart/mixed (inline, None, 0 bytes)
View raw message