zookeeper-dev mailing list archives

Site index · List index
Message view « Date » · « Thread »
Top « Date » · « Thread »
From Apache Jenkins Server <jenk...@builds.apache.org>
Subject Failed: ZOOKEEPER- PreCommit Build #1274
Date Sat, 18 Nov 2017 20:47:43 GMT
Build: https://builds.apache.org/job/PreCommit-ZOOKEEPER-github-pr-build/1274/

###################################################################################
########################## LAST 60 LINES OF THE CONSOLE ###########################
[...truncated 67.85 MB...]
     [exec] 
     [exec]     +1 javadoc.  The javadoc tool did not generate any warning messages.
     [exec] 
     [exec]     +1 javac.  The applied patch does not increase the total number of javac compiler
warnings.
     [exec] 
     [exec]     -1 findbugs.  The patch appears to introduce 1 new Findbugs (version 3.0.1)
warnings.
     [exec] 
     [exec]     +1 release audit.  The applied patch does not increase the total number of
release audit warnings.
     [exec] 
     [exec]     -1 core tests.  The patch failed core unit tests.
     [exec] 
     [exec]     +1 contrib tests.  The patch passed contrib unit tests.
     [exec] 
     [exec] Test results: https://builds.apache.org/job/PreCommit-ZOOKEEPER-github-pr-build/1274//testReport/
     [exec] Findbugs warnings: https://builds.apache.org/job/PreCommit-ZOOKEEPER-github-pr-build/1274//artifact/trunk/build/test/findbugs/newPatchFindbugsWarnings.html
     [exec] Console output: https://builds.apache.org/job/PreCommit-ZOOKEEPER-github-pr-build/1274//console
     [exec] 
     [exec] This message is automatically generated.
     [exec] 
     [exec] 
     [exec] ======================================================================
     [exec] ======================================================================
     [exec]     Adding comment to Jira.
     [exec] ======================================================================
     [exec] ======================================================================
     [exec] 
     [exec] 
     [exec] Comment added.
     [exec] b5095b0d6009d8712c828aebb96639e45c2839f0 logged out
     [exec] 
     [exec] 
     [exec] ======================================================================
     [exec] ======================================================================
     [exec]     Finished build.
     [exec] ======================================================================
     [exec] ======================================================================
     [exec] 
     [exec] 
     [exec] mv: '/home/jenkins/jenkins-slave/workspace/PreCommit-ZOOKEEPER-github-pr-build/patchprocess'
and '/home/jenkins/jenkins-slave/workspace/PreCommit-ZOOKEEPER-github-pr-build/patchprocess'
are the same file

BUILD FAILED
/home/jenkins/jenkins-slave/workspace/PreCommit-ZOOKEEPER-github-pr-build/build.xml:1713:
exec returned: 2

Total time: 14 minutes 38 seconds
Build step 'Execute shell' marked build as failure
Archiving artifacts
Setting JDK_1_7_LATEST__HOME=/home/jenkins/tools/java/latest1.7
[Fast Archiver] Compressed 582.79 KB of artifacts by 27.5% relative to #1213
Recording test results
Setting JDK_1_7_LATEST__HOME=/home/jenkins/tools/java/latest1.7
Setting JDK_1_7_LATEST__HOME=/home/jenkins/tools/java/latest1.7
[description-setter] Description set: ZOOKEEPER-2939
Putting comment on the pull request
Setting JDK_1_7_LATEST__HOME=/home/jenkins/tools/java/latest1.7
Email was triggered for: Failure - Any
Sending email for trigger: Failure - Any
Setting JDK_1_7_LATEST__HOME=/home/jenkins/tools/java/latest1.7
Setting JDK_1_7_LATEST__HOME=/home/jenkins/tools/java/latest1.7
Setting JDK_1_7_LATEST__HOME=/home/jenkins/tools/java/latest1.7



###################################################################################
############################## FAILED TESTS (if any) ##############################
3 tests failed.
FAILED:  org.apache.zookeeper.server.quorum.ReconfigFailureCasesTest.testLeaderTimesoutOnNewQuorum

Error Message:
expected:<[leaderelection]> but was:<[following]>

Stack Trace:
junit.framework.AssertionFailedError: expected:<[leaderelection]> but was:<[following]>
	at org.apache.zookeeper.server.quorum.ReconfigFailureCasesTest.testLeaderTimesoutOnNewQuorum(ReconfigFailureCasesTest.java:198)
	at org.apache.zookeeper.JUnit4ZKTestRunner$LoggedInvokeMethod.evaluate(JUnit4ZKTestRunner.java:79)


FAILED:  org.apache.zookeeper.server.quorum.ReconfigRecoveryTest.testCurrentObserverIsParticipantInNewConfig

Error Message:
waiting for server 2 being up

Stack Trace:
junit.framework.AssertionFailedError: waiting for server 2 being up
	at org.apache.zookeeper.server.quorum.ReconfigRecoveryTest.testCurrentObserverIsParticipantInNewConfig(ReconfigRecoveryTest.java:536)
	at org.apache.zookeeper.JUnit4ZKTestRunner$LoggedInvokeMethod.evaluate(JUnit4ZKTestRunner.java:79)


FAILED:  org.apache.zookeeper.test.WatchEventWhenAutoResetTest.testNodeDataChanged

Error Message:
expected:<NodeDataChanged> but was:<NodeDeleted>

Stack Trace:
junit.framework.AssertionFailedError: expected:<NodeDataChanged> but was:<NodeDeleted>
	at org.apache.zookeeper.test.WatchEventWhenAutoResetTest$EventsWatcher.assertEvent(WatchEventWhenAutoResetTest.java:67)
	at org.apache.zookeeper.test.WatchEventWhenAutoResetTest.testNodeDataChanged(WatchEventWhenAutoResetTest.java:117)
	at org.apache.zookeeper.JUnit4ZKTestRunner$LoggedInvokeMethod.evaluate(JUnit4ZKTestRunner.java:79)
Mime
  • Unnamed multipart/mixed (inline, None, 0 bytes)
View raw message