zookeeper-dev mailing list archives

Site index · List index
Message view « Date » · « Thread »
Top « Date » · « Thread »
From Apache Jenkins Server <jenk...@builds.apache.org>
Subject ZooKeeper_branch34_openjdk7 - Build # 1703 - Failure
Date Wed, 01 Nov 2017 19:56:35 GMT
See https://builds.apache.org/job/ZooKeeper_branch34_openjdk7/1703/

###################################################################################
########################## LAST 60 LINES OF THE CONSOLE ###########################
[...truncated 32.62 MB...]
    [junit] 2017-11-01 19:56:32,674 [myid:] - INFO  [main:FinalRequestProcessor@403] - shutdown
of request processor complete
    [junit] 2017-11-01 19:56:32,674 [myid:] - INFO  [main:FourLetterWordMain@65] - connecting
to 127.0.0.1 11221
    [junit] 2017-11-01 19:56:32,674 [myid:] - INFO  [main:JMXEnv@147] - ensureOnly:[]
    [junit] 2017-11-01 19:56:32,675 [myid:] - INFO  [main:ClientBase@489] - STARTING server
    [junit] 2017-11-01 19:56:32,675 [myid:] - INFO  [main:ClientBase@410] - CREATING server
instance 127.0.0.1:11221
    [junit] 2017-11-01 19:56:32,676 [myid:] - INFO  [main:ServerCnxnFactory@117] - Using org.apache.zookeeper.server.NIOServerCnxnFactory
as server connection factory
    [junit] 2017-11-01 19:56:32,676 [myid:] - INFO  [main:NIOServerCnxnFactory@89] - binding
to port 0.0.0.0/0.0.0.0:11221
    [junit] 2017-11-01 19:56:32,676 [myid:] - INFO  [main:ClientBase@385] - STARTING server
instance 127.0.0.1:11221
    [junit] 2017-11-01 19:56:32,676 [myid:] - INFO  [main:ZooKeeperServer@173] - Created server
with tickTime 3000 minSessionTimeout 6000 maxSessionTimeout 60000 datadir /home/jenkins/jenkins-slave/workspace/ZooKeeper_branch34_openjdk7/build/test/tmp/test8121752213418608106.junit.dir/version-2
snapdir /home/jenkins/jenkins-slave/workspace/ZooKeeper_branch34_openjdk7/build/test/tmp/test8121752213418608106.junit.dir/version-2
    [junit] 2017-11-01 19:56:32,680 [myid:] - ERROR [main:ZooKeeperServer@468] - ZKShutdownHandler
is not registered, so ZooKeeper server won't take any action on ERROR or SHUTDOWN server state
changes
    [junit] 2017-11-01 19:56:32,680 [myid:] - INFO  [main:FourLetterWordMain@65] - connecting
to 127.0.0.1 11221
    [junit] 2017-11-01 19:56:32,680 [myid:] - INFO  [NIOServerCxn.Factory:0.0.0.0/0.0.0.0:11221:NIOServerCnxnFactory@215]
- Accepted socket connection from /127.0.0.1:60182
    [junit] 2017-11-01 19:56:32,680 [myid:] - INFO  [NIOServerCxn.Factory:0.0.0.0/0.0.0.0:11221:NIOServerCnxn@892]
- Processing stat command from /127.0.0.1:60182
    [junit] 2017-11-01 19:56:32,681 [myid:] - INFO  [Thread-4:NIOServerCnxn$StatCommand@683]
- Stat command output
    [junit] 2017-11-01 19:56:32,681 [myid:] - INFO  [Thread-4:NIOServerCnxn@1040] - Closed
socket connection for client /127.0.0.1:60182 (no session established for client)
    [junit] 2017-11-01 19:56:32,681 [myid:] - INFO  [main:JMXEnv@230] - ensureParent:[InMemoryDataTree,
StandaloneServer_port]
    [junit] 2017-11-01 19:56:32,683 [myid:] - INFO  [main:JMXEnv@247] - expect:InMemoryDataTree
    [junit] 2017-11-01 19:56:32,683 [myid:] - INFO  [main:JMXEnv@251] - found:InMemoryDataTree
org.apache.ZooKeeperService:name0=StandaloneServer_port11221,name1=InMemoryDataTree
    [junit] 2017-11-01 19:56:32,683 [myid:] - INFO  [main:JMXEnv@247] - expect:StandaloneServer_port
    [junit] 2017-11-01 19:56:32,683 [myid:] - INFO  [main:JMXEnv@251] - found:StandaloneServer_port
org.apache.ZooKeeperService:name0=StandaloneServer_port11221
    [junit] 2017-11-01 19:56:32,683 [myid:] - INFO  [main:JUnit4ZKTestRunner$LoggedInvokeMethod@58]
- Memory used 20139
    [junit] 2017-11-01 19:56:32,684 [myid:] - INFO  [main:JUnit4ZKTestRunner$LoggedInvokeMethod@63]
- Number of threads 20
    [junit] 2017-11-01 19:56:32,684 [myid:] - INFO  [main:JUnit4ZKTestRunner$LoggedInvokeMethod@78]
- FINISHED TEST METHOD testQuota
    [junit] 2017-11-01 19:56:32,684 [myid:] - INFO  [main:ClientBase@566] - tearDown starting
    [junit] 2017-11-01 19:56:32,760 [myid:] - INFO  [main-EventThread:ClientCnxn$EventThread@520]
- EventThread shut down for session: 0x1053584e7f40000
    [junit] 2017-11-01 19:56:32,760 [myid:] - INFO  [main:ZooKeeper@687] - Session: 0x1053584e7f40000
closed
    [junit] 2017-11-01 19:56:32,760 [myid:] - INFO  [main:ClientBase@536] - STOPPING server
    [junit] 2017-11-01 19:56:32,761 [myid:] - INFO  [NIOServerCxn.Factory:0.0.0.0/0.0.0.0:11221:NIOServerCnxnFactory@242]
- NIOServerCnxn factory exited run method
    [junit] 2017-11-01 19:56:32,761 [myid:] - INFO  [main:ZooKeeperServer@501] - shutting
down
    [junit] 2017-11-01 19:56:32,761 [myid:] - ERROR [main:ZooKeeperServer@468] - ZKShutdownHandler
is not registered, so ZooKeeper server won't take any action on ERROR or SHUTDOWN server state
changes
    [junit] 2017-11-01 19:56:32,761 [myid:] - INFO  [main:SessionTrackerImpl@226] - Shutting
down
    [junit] 2017-11-01 19:56:32,761 [myid:] - INFO  [main:PrepRequestProcessor@769] - Shutting
down
    [junit] 2017-11-01 19:56:32,761 [myid:] - INFO  [main:SyncRequestProcessor@208] - Shutting
down
    [junit] 2017-11-01 19:56:32,761 [myid:] - INFO  [ProcessThread(sid:0 cport:11221)::PrepRequestProcessor@144]
- PrepRequestProcessor exited loop!
    [junit] 2017-11-01 19:56:32,762 [myid:] - INFO  [SyncThread:0:SyncRequestProcessor@186]
- SyncRequestProcessor exited!
    [junit] 2017-11-01 19:56:32,762 [myid:] - INFO  [main:FinalRequestProcessor@403] - shutdown
of request processor complete
    [junit] 2017-11-01 19:56:32,762 [myid:] - INFO  [main:FourLetterWordMain@65] - connecting
to 127.0.0.1 11221
    [junit] 2017-11-01 19:56:32,763 [myid:] - INFO  [main:JMXEnv@147] - ensureOnly:[]
    [junit] 2017-11-01 19:56:32,767 [myid:] - INFO  [main:ClientBase@591] - fdcount after
test is: 98 at start it was 86
    [junit] 2017-11-01 19:56:32,767 [myid:] - INFO  [main:ClientBase@593] - sleeping for 20
secs
    [junit] 2017-11-01 19:56:32,767 [myid:] - INFO  [main:ZKTestCase$1@69] - SUCCEEDED testQuota
    [junit] 2017-11-01 19:56:32,768 [myid:] - INFO  [main:ZKTestCase$1@64] - FINISHED testQuota
    [junit] Tests run: 1, Failures: 0, Errors: 0, Skipped: 0, Time elapsed: 0.741 sec

fail.build.on.test.failure:

BUILD FAILED
/home/jenkins/jenkins-slave/workspace/ZooKeeper_branch34_openjdk7/build.xml:1382: The following
error occurred while executing this line:
/home/jenkins/jenkins-slave/workspace/ZooKeeper_branch34_openjdk7/build.xml:1385: Tests failed!

Total time: 30 minutes 47 seconds
Build step 'Invoke Ant' marked build as failure
Recording test results
Setting OPENJDK_7_ON_UBUNTU_ONLY__HOME=/usr/lib/jvm/java-7-openjdk-amd64/
Setting OPENJDK_7_ON_UBUNTU_ONLY__HOME=/usr/lib/jvm/java-7-openjdk-amd64/
Email was triggered for: Failure - Any
Sending email for trigger: Failure - Any
Setting OPENJDK_7_ON_UBUNTU_ONLY__HOME=/usr/lib/jvm/java-7-openjdk-amd64/
Setting OPENJDK_7_ON_UBUNTU_ONLY__HOME=/usr/lib/jvm/java-7-openjdk-amd64/



###################################################################################
############################## FAILED TESTS (if any) ##############################
1 tests failed.
FAILED:  org.apache.zookeeper.server.quorum.Zab1_0Test.testNormalFollowerRunWithDiff

Error Message:
expected:<4294967298> but was:<0>

Stack Trace:
junit.framework.AssertionFailedError: expected:<4294967298> but was:<0>
	at org.apache.zookeeper.server.quorum.Zab1_0Test$5.converseWithFollower(Zab1_0Test.java:861)
	at org.apache.zookeeper.server.quorum.Zab1_0Test.testFollowerConversation(Zab1_0Test.java:507)
	at org.apache.zookeeper.server.quorum.Zab1_0Test.testNormalFollowerRunWithDiff(Zab1_0Test.java:777)
Mime
  • Unnamed multipart/mixed (inline, None, 0 bytes)
View raw message