zookeeper-dev mailing list archives

Site index · List index
Message view « Date » · « Thread »
Top « Date » · « Thread »
From Apache Jenkins Server <jenk...@builds.apache.org>
Subject ZooKeeper-trunk-jdk8 - Build # 1263 - Failure
Date Fri, 03 Nov 2017 05:01:21 GMT
See https://builds.apache.org/job/ZooKeeper-trunk-jdk8/1263/

###################################################################################
########################## LAST 60 LINES OF THE CONSOLE ###########################
[...truncated 67.98 MB...]
    [junit] 2017-11-03 05:01:17,040 [myid:127.0.0.1:11222] - WARN  [main-SendThread(127.0.0.1:11222):ClientCnxn$SendThread@1235]
- Session 0x1018c7f93340000 for server 127.0.0.1/127.0.0.1:11222, unexpected error, closing
socket connection and attempting reconnect
    [junit] java.net.ConnectException: Connection refused
    [junit] 	at sun.nio.ch.SocketChannelImpl.checkConnect(Native Method)
    [junit] 	at sun.nio.ch.SocketChannelImpl.finishConnect(SocketChannelImpl.java:717)
    [junit] 	at org.apache.zookeeper.ClientCnxnSocketNIO.doTransport(ClientCnxnSocketNIO.java:357)
    [junit] 	at org.apache.zookeeper.ClientCnxn$SendThread.run(ClientCnxn.java:1214)
    [junit] 2017-11-03 05:01:17,049 [myid:] - INFO  [ProcessThread(sid:0 cport:11468)::PrepRequestProcessor@614]
- Processed session termination for sessionid: 0x1018c8902c10000
    [junit] 2017-11-03 05:01:17,056 [myid:] - INFO  [SyncThread:0:MBeanRegistry@128] - Unregister
MBean [org.apache.ZooKeeperService:name0=StandaloneServer_port11468,name1=Connections,name2=127.0.0.1,name3=0x1018c8902c10000]
    [junit] 2017-11-03 05:01:17,056 [myid:] - INFO  [main:ZooKeeper@1332] - Session: 0x1018c8902c10000
closed
    [junit] 2017-11-03 05:01:17,056 [myid:] - INFO  [main-EventThread:ClientCnxn$EventThread@513]
- EventThread shut down for session: 0x1018c8902c10000
    [junit] 2017-11-03 05:01:17,057 [myid:] - WARN  [New I/O worker #10047:NettyServerCnxnFactory$CnxnChannelHandler@142]
- Exception caught [id: 0xe1542ed7, /127.0.0.1:34654 :> /127.0.0.1:11468] EXCEPTION: java.nio.channels.ClosedChannelException
    [junit] java.nio.channels.ClosedChannelException
    [junit] 	at org.jboss.netty.channel.socket.nio.AbstractNioWorker.cleanUpWriteBuffer(AbstractNioWorker.java:433)
    [junit] 	at org.jboss.netty.channel.socket.nio.AbstractNioWorker.close(AbstractNioWorker.java:373)
    [junit] 	at org.jboss.netty.channel.socket.nio.NioWorker.read(NioWorker.java:93)
    [junit] 	at org.jboss.netty.channel.socket.nio.AbstractNioWorker.process(AbstractNioWorker.java:108)
    [junit] 	at org.jboss.netty.channel.socket.nio.AbstractNioSelector.run(AbstractNioSelector.java:337)
    [junit] 	at org.jboss.netty.channel.socket.nio.AbstractNioWorker.run(AbstractNioWorker.java:89)
    [junit] 	at org.jboss.netty.channel.socket.nio.NioWorker.run(NioWorker.java:178)
    [junit] 	at org.jboss.netty.util.ThreadRenamingRunnable.run(ThreadRenamingRunnable.java:108)
    [junit] 	at org.jboss.netty.util.internal.DeadLockProofWorker$1.run(DeadLockProofWorker.java:42)
    [junit] 	at java.util.concurrent.ThreadPoolExecutor.runWorker(ThreadPoolExecutor.java:1149)
    [junit] 	at java.util.concurrent.ThreadPoolExecutor$Worker.run(ThreadPoolExecutor.java:624)
    [junit] 	at java.lang.Thread.run(Thread.java:748)
    [junit] 2017-11-03 05:01:17,057 [myid:] - INFO  [main:JUnit4ZKTestRunner$LoggedInvokeMethod@82]
- Memory used 221068
    [junit] 2017-11-03 05:01:17,057 [myid:] - INFO  [main:JUnit4ZKTestRunner$LoggedInvokeMethod@87]
- Number of threads 2432
    [junit] 2017-11-03 05:01:17,057 [myid:] - INFO  [main:JUnit4ZKTestRunner$LoggedInvokeMethod@102]
- FINISHED TEST METHOD testWatcherAutoResetWithLocal
    [junit] 2017-11-03 05:01:17,057 [myid:] - INFO  [main:ClientBase@601] - tearDown starting
    [junit] 2017-11-03 05:01:17,057 [myid:] - INFO  [main:ClientBase@571] - STOPPING server
    [junit] 2017-11-03 05:01:17,057 [myid:] - INFO  [main:NettyServerCnxnFactory@464] - shutdown
called 0.0.0.0/0.0.0.0:11468
    [junit] 2017-11-03 05:01:17,061 [myid:] - INFO  [main:ZooKeeperServer@545] - shutting
down
    [junit] 2017-11-03 05:01:17,062 [myid:] - ERROR [main:ZooKeeperServer@509] - ZKShutdownHandler
is not registered, so ZooKeeper server won't take any action on ERROR or SHUTDOWN server state
changes
    [junit] 2017-11-03 05:01:17,062 [myid:] - INFO  [main:SessionTrackerImpl@232] - Shutting
down
    [junit] 2017-11-03 05:01:17,062 [myid:] - INFO  [main:PrepRequestProcessor@1010] - Shutting
down
    [junit] 2017-11-03 05:01:17,062 [myid:] - INFO  [main:SyncRequestProcessor@191] - Shutting
down
    [junit] 2017-11-03 05:01:17,062 [myid:] - INFO  [ProcessThread(sid:0 cport:11468)::PrepRequestProcessor@155]
- PrepRequestProcessor exited loop!
    [junit] 2017-11-03 05:01:17,062 [myid:] - INFO  [SyncThread:0:SyncRequestProcessor@169]
- SyncRequestProcessor exited!
    [junit] 2017-11-03 05:01:17,062 [myid:] - INFO  [main:FinalRequestProcessor@481] - shutdown
of request processor complete
    [junit] 2017-11-03 05:01:17,062 [myid:] - INFO  [main:MBeanRegistry@128] - Unregister
MBean [org.apache.ZooKeeperService:name0=StandaloneServer_port11468,name1=InMemoryDataTree]
    [junit] 2017-11-03 05:01:17,062 [myid:] - INFO  [main:MBeanRegistry@128] - Unregister
MBean [org.apache.ZooKeeperService:name0=StandaloneServer_port11468]
    [junit] 2017-11-03 05:01:17,063 [myid:] - INFO  [main:FourLetterWordMain@87] - connecting
to 127.0.0.1 11468
    [junit] 2017-11-03 05:01:17,063 [myid:] - INFO  [main:JMXEnv@146] - ensureOnly:[]
    [junit] 2017-11-03 05:01:17,069 [myid:] - INFO  [main:ClientBase@626] - fdcount after
test is: 7157 at start it was 7157
    [junit] 2017-11-03 05:01:17,069 [myid:] - INFO  [main:ZKTestCase$1@68] - SUCCEEDED testWatcherAutoResetWithLocal
    [junit] 2017-11-03 05:01:17,069 [myid:] - INFO  [main:ZKTestCase$1@63] - FINISHED testWatcherAutoResetWithLocal
    [junit] Tests run: 105, Failures: 0, Errors: 0, Skipped: 0, Time elapsed: 623.968 sec,
Thread: 1, Class: org.apache.zookeeper.test.NioNettySuiteTest

fail.build.on.test.failure:

BUILD FAILED
/home/jenkins/jenkins-slave/workspace/ZooKeeper-trunk-jdk8/build.xml:1267: The following error
occurred while executing this line:
/home/jenkins/jenkins-slave/workspace/ZooKeeper-trunk-jdk8/build.xml:1271: Tests failed!

Total time: 16 minutes 57 seconds
Build step 'Invoke Ant' marked build as failure
[WARNINGS] Skipping publisher since build result is FAILURE
Recording test results
Email was triggered for: Failure - Any
Sending email for trigger: Failure - Any



###################################################################################
############################## FAILED TESTS (if any) ##############################
1 tests failed.
FAILED:  org.apache.zookeeper.test.SSLTest.testSecureQuorumServer

Error Message:
waiting for server 0 being up

Stack Trace:
junit.framework.AssertionFailedError: waiting for server 0 being up
	at org.apache.zookeeper.test.SSLTest.testSecureQuorumServer(SSLTest.java:96)
	at org.apache.zookeeper.JUnit4ZKTestRunner$LoggedInvokeMethod.evaluate(JUnit4ZKTestRunner.java:79)
Mime
  • Unnamed multipart/mixed (inline, None, 0 bytes)
View raw message