zookeeper-dev mailing list archives

Site index · List index
Message view « Date » · « Thread »
Top « Date » · « Thread »
From Apache Jenkins Server <jenk...@builds.apache.org>
Subject ZooKeeper-trunk-openjdk7 - Build # 1702 - Still Failing
Date Fri, 17 Nov 2017 20:30:46 GMT
See https://builds.apache.org/job/ZooKeeper-trunk-openjdk7/1702/

###################################################################################
########################## LAST 60 LINES OF THE CONSOLE ###########################
[...truncated 66.14 MB...]
    [junit] java.net.ConnectException: Connection refused: 127.0.0.1/127.0.0.1:11309
    [junit] 	at sun.nio.ch.SocketChannelImpl.checkConnect(Native Method)
    [junit] 	at sun.nio.ch.SocketChannelImpl.finishConnect(SocketChannelImpl.java:744)
    [junit] 	at org.jboss.netty.channel.socket.nio.NioClientBoss.connect(NioClientBoss.java:152)
    [junit] 	at org.jboss.netty.channel.socket.nio.NioClientBoss.processSelectedKeys(NioClientBoss.java:105)
    [junit] 	at org.jboss.netty.channel.socket.nio.NioClientBoss.process(NioClientBoss.java:79)
    [junit] 	at org.jboss.netty.channel.socket.nio.AbstractNioSelector.run(AbstractNioSelector.java:337)
    [junit] 	at org.jboss.netty.channel.socket.nio.NioClientBoss.run(NioClientBoss.java:42)
    [junit] 	at org.jboss.netty.util.ThreadRenamingRunnable.run(ThreadRenamingRunnable.java:108)
    [junit] 	at org.jboss.netty.util.internal.DeadLockProofWorker$1.run(DeadLockProofWorker.java:42)
    [junit] 	at java.util.concurrent.ThreadPoolExecutor.runWorker(ThreadPoolExecutor.java:1152)
    [junit] 	at java.util.concurrent.ThreadPoolExecutor$Worker.run(ThreadPoolExecutor.java:622)
    [junit] 	at java.lang.Thread.run(Thread.java:748)
    [junit] 2017-11-17 20:30:43,300 [myid:] - INFO  [New I/O boss #8877:ClientCnxnSocketNetty@208]
- channel is told closing
    [junit] 2017-11-17 20:30:43,300 [myid:127.0.0.1:11309] - INFO  [main-SendThread(127.0.0.1:11309):ClientCnxn$SendThread@1231]
- channel for sessionid 0x500d2cdca7c0001 is lost, closing socket connection and attempting
reconnect
    [junit] 2017-11-17 20:30:43,326 [myid:127.0.0.1:11297] - INFO  [main-SendThread(127.0.0.1:11297):ClientCnxn$SendThread@1113]
- Opening socket connection to server 127.0.0.1/127.0.0.1:11297. Will not attempt to authenticate
using SASL (unknown error)
    [junit] 2017-11-17 20:30:43,326 [myid:] - INFO  [New I/O boss #8514:ClientCnxnSocketNetty$1@127]
- future isn't success, cause: {}
    [junit] java.net.ConnectException: Connection refused: 127.0.0.1/127.0.0.1:11297
    [junit] 	at sun.nio.ch.SocketChannelImpl.checkConnect(Native Method)
    [junit] 	at sun.nio.ch.SocketChannelImpl.finishConnect(SocketChannelImpl.java:744)
    [junit] 	at org.jboss.netty.channel.socket.nio.NioClientBoss.connect(NioClientBoss.java:152)
    [junit] 	at org.jboss.netty.channel.socket.nio.NioClientBoss.processSelectedKeys(NioClientBoss.java:105)
    [junit] 	at org.jboss.netty.channel.socket.nio.NioClientBoss.process(NioClientBoss.java:79)
    [junit] 	at org.jboss.netty.channel.socket.nio.AbstractNioSelector.run(AbstractNioSelector.java:337)
    [junit] 	at org.jboss.netty.channel.socket.nio.NioClientBoss.run(NioClientBoss.java:42)
    [junit] 	at org.jboss.netty.util.ThreadRenamingRunnable.run(ThreadRenamingRunnable.java:108)
    [junit] 	at org.jboss.netty.util.internal.DeadLockProofWorker$1.run(DeadLockProofWorker.java:42)
    [junit] 	at java.util.concurrent.ThreadPoolExecutor.runWorker(ThreadPoolExecutor.java:1152)
    [junit] 	at java.util.concurrent.ThreadPoolExecutor$Worker.run(ThreadPoolExecutor.java:622)
    [junit] 	at java.lang.Thread.run(Thread.java:748)
    [junit] 2017-11-17 20:30:43,370 [myid:] - WARN  [New I/O boss #8514:ClientCnxnSocketNetty$ZKClientHandler@439]
- Exception caught: [id: 0x28eca8c4] EXCEPTION: java.net.ConnectException: Connection refused:
127.0.0.1/127.0.0.1:11297
    [junit] java.net.ConnectException: Connection refused: 127.0.0.1/127.0.0.1:11297
    [junit] 	at sun.nio.ch.SocketChannelImpl.checkConnect(Native Method)
    [junit] 	at sun.nio.ch.SocketChannelImpl.finishConnect(SocketChannelImpl.java:744)
    [junit] 	at org.jboss.netty.channel.socket.nio.NioClientBoss.connect(NioClientBoss.java:152)
    [junit] 	at org.jboss.netty.channel.socket.nio.NioClientBoss.processSelectedKeys(NioClientBoss.java:105)
    [junit] 	at org.jboss.netty.channel.socket.nio.NioClientBoss.process(NioClientBoss.java:79)
    [junit] 	at org.jboss.netty.channel.socket.nio.AbstractNioSelector.run(AbstractNioSelector.java:337)
    [junit] 	at org.jboss.netty.channel.socket.nio.NioClientBoss.run(NioClientBoss.java:42)
    [junit] 	at org.jboss.netty.util.ThreadRenamingRunnable.run(ThreadRenamingRunnable.java:108)
    [junit] 	at org.jboss.netty.util.internal.DeadLockProofWorker$1.run(DeadLockProofWorker.java:42)
    [junit] 	at java.util.concurrent.ThreadPoolExecutor.runWorker(ThreadPoolExecutor.java:1152)
    [junit] 	at java.util.concurrent.ThreadPoolExecutor$Worker.run(ThreadPoolExecutor.java:622)
    [junit] 	at java.lang.Thread.run(Thread.java:748)
    [junit] 2017-11-17 20:30:43,370 [myid:] - INFO  [New I/O boss #8514:ClientCnxnSocketNetty@208]
- channel is told closing
    [junit] 2017-11-17 20:30:43,370 [myid:127.0.0.1:11297] - INFO  [main-SendThread(127.0.0.1:11297):ClientCnxn$SendThread@1231]
- channel for sessionid 0x100d2cd98360000 is lost, closing socket connection and attempting
reconnect
    [junit] Test org.apache.zookeeper.test.NettyNettySuiteTest FAILED

fail.build.on.test.failure:

BUILD FAILED
/home/jenkins/jenkins-slave/workspace/ZooKeeper-trunk-openjdk7/build.xml:1267: The following
error occurred while executing this line:
/home/jenkins/jenkins-slave/workspace/ZooKeeper-trunk-openjdk7/build.xml:1271: Tests failed!

Total time: 14 minutes 16 seconds
Build step 'Invoke Ant' marked build as failure
Recording test results
Email was triggered for: Failure - Any
Sending email for trigger: Failure - Any



###################################################################################
############################## FAILED TESTS (if any) ##############################
4 tests failed.
FAILED:  org.apache.zookeeper.test.FourLetterWordsQuorumTest.testFourLetterWords

Error Message:
Exception while executing four letter word: dirs

Stack Trace:
java.io.IOException: Exception while executing four letter word: dirs
	at org.apache.zookeeper.client.FourLetterWordMain.send4LetterWord(FourLetterWordMain.java:126)
	at org.apache.zookeeper.client.FourLetterWordMain.send4LetterWord(FourLetterWordMain.java:56)
	at org.apache.zookeeper.test.FourLetterWordsQuorumTest.verify(FourLetterWordsQuorumTest.java:109)
	at org.apache.zookeeper.test.FourLetterWordsQuorumTest.testFourLetterWords(FourLetterWordsQuorumTest.java:67)
	at org.apache.zookeeper.JUnit4ZKTestRunner$LoggedInvokeMethod.evaluate(JUnit4ZKTestRunner.java:79)
Caused by: java.net.SocketTimeoutException: Read timed out
	at java.net.SocketInputStream.socketRead0(Native Method)
	at java.net.SocketInputStream.read(SocketInputStream.java:153)
	at java.net.SocketInputStream.read(SocketInputStream.java:122)
	at sun.nio.cs.StreamDecoder.readBytes(StreamDecoder.java:283)
	at sun.nio.cs.StreamDecoder.implRead(StreamDecoder.java:325)
	at sun.nio.cs.StreamDecoder.read(StreamDecoder.java:177)
	at java.io.InputStreamReader.read(InputStreamReader.java:184)
	at java.io.BufferedReader.fill(BufferedReader.java:154)
	at java.io.BufferedReader.readLine(BufferedReader.java:317)
	at java.io.BufferedReader.readLine(BufferedReader.java:382)
	at org.apache.zookeeper.client.FourLetterWordMain.send4LetterWord(FourLetterWordMain.java:121)


FAILED:  org.apache.zookeeper.test.ReconfigTest.testQuorumSystemChange

Error Message:
KeeperErrorCode = Session expired

Stack Trace:
org.apache.zookeeper.KeeperException$SessionExpiredException: KeeperErrorCode = Session expired
	at org.apache.zookeeper.KeeperException.create(KeeperException.java:134)
	at org.apache.zookeeper.KeeperException.create(KeeperException.java:54)
	at org.apache.zookeeper.admin.ZooKeeperAdmin.reconfigure(ZooKeeperAdmin.java:187)
	at org.apache.zookeeper.admin.ZooKeeperAdmin.reconfigure(ZooKeeperAdmin.java:204)
	at org.apache.zookeeper.test.ReconfigTest.reconfig(ReconfigTest.java:84)
	at org.apache.zookeeper.test.ReconfigTest.testQuorumSystemChange(ReconfigTest.java:870)
	at org.apache.zookeeper.JUnit4ZKTestRunner$LoggedInvokeMethod.evaluate(JUnit4ZKTestRunner.java:79)


FAILED:  org.apache.zookeeper.test.ReconfigTest.testQuorumSystemChange

Error Message:
KeeperErrorCode = Session expired for /test

Stack Trace:
org.apache.zookeeper.KeeperException$SessionExpiredException: KeeperErrorCode = Session expired
for /test
	at org.apache.zookeeper.KeeperException.create(KeeperException.java:134)
	at org.apache.zookeeper.KeeperException.create(KeeperException.java:54)
	at org.apache.zookeeper.ZooKeeper.create(ZooKeeper.java:1446)
	at org.apache.zookeeper.test.ReconfigTest.createZNode(ReconfigTest.java:192)
	at org.apache.zookeeper.test.ReconfigTest.testNormalOperation(ReconfigTest.java:160)
	at org.apache.zookeeper.test.ReconfigTest.testQuorumSystemChange(ReconfigTest.java:873)
	at org.apache.zookeeper.JUnit4ZKTestRunner$LoggedInvokeMethod.evaluate(JUnit4ZKTestRunner.java:79)


FAILED:  org.apache.zookeeper.test.ReconfigTest.testRemoveOneAsynchronous

Error Message:
expected:<0> but was:<-4>

Stack Trace:
junit.framework.AssertionFailedError: expected:<0> but was:<-4>
	at org.apache.zookeeper.test.ReconfigTest.testRemoveOneAsynchronous(ReconfigTest.java:491)
	at org.apache.zookeeper.JUnit4ZKTestRunner$LoggedInvokeMethod.evaluate(JUnit4ZKTestRunner.java:79)
Mime
  • Unnamed multipart/mixed (inline, None, 0 bytes)
View raw message