zookeeper-dev mailing list archives

Site index · List index
Message view « Date » · « Thread »
Top « Date » · « Thread »
From Apache Jenkins Server <jenk...@builds.apache.org>
Subject Failed: ZOOKEEPER- PreCommit Build #1166
Date Tue, 07 Nov 2017 01:39:58 GMT
Build: https://builds.apache.org/job/PreCommit-ZOOKEEPER-github-pr-build/1166/

###################################################################################
########################## LAST 60 LINES OF THE CONSOLE ###########################
[...truncated 39.04 MB...]
     [exec] 
     [exec]     +1 javadoc.  The javadoc tool did not generate any warning messages.
     [exec] 
     [exec]     +1 javac.  The applied patch does not increase the total number of javac compiler warnings.
     [exec] 
     [exec]     +1 findbugs.  The patch does not introduce any new Findbugs (version 3.0.1) warnings.
     [exec] 
     [exec]     +1 release audit.  The applied patch does not increase the total number of release audit warnings.
     [exec] 
     [exec]     -1 core tests.  The patch failed core unit tests.
     [exec] 
     [exec]     -1 contrib tests.  The patch failed contrib unit tests.
     [exec] 
     [exec] Test results: https://builds.apache.org/job/PreCommit-ZOOKEEPER-github-pr-build/1166//testReport/
     [exec] Findbugs warnings: https://builds.apache.org/job/PreCommit-ZOOKEEPER-github-pr-build/1166//artifact/trunk/build/test/findbugs/newPatchFindbugsWarnings.html
     [exec] Console output: https://builds.apache.org/job/PreCommit-ZOOKEEPER-github-pr-build/1166//console
     [exec] 
     [exec] This message is automatically generated.
     [exec] 
     [exec] 
     [exec] ======================================================================
     [exec] ======================================================================
     [exec]     Adding comment to Jira.
     [exec] ======================================================================
     [exec] ======================================================================
     [exec] 
     [exec] 
     [exec] Comment added.
     [exec] fd69910542c4fba7189b11dabf8d0c51ecfa36aa logged out
     [exec] 
     [exec] 
     [exec] ======================================================================
     [exec] ======================================================================
     [exec]     Finished build.
     [exec] ======================================================================
     [exec] ======================================================================
     [exec] 
     [exec] 
     [exec] mv: ‘/home/jenkins/jenkins-slave/workspace/PreCommit-ZOOKEEPER-github-pr-build/patchprocess’ and ‘/home/jenkins/jenkins-slave/workspace/PreCommit-ZOOKEEPER-github-pr-build/patchprocess’ are the same file

BUILD FAILED
/home/jenkins/jenkins-slave/workspace/PreCommit-ZOOKEEPER-github-pr-build/build.xml:1713: exec returned: 2

Total time: 7 minutes 13 seconds
Build step 'Execute shell' marked build as failure
Archiving artifacts
Setting JDK_1_7_LATEST__HOME=/home/jenkins/tools/java/latest1.7
[Fast Archiver] Compressed 577.19 KB of artifacts by 49.9% relative to #1162
Recording test results
Setting JDK_1_7_LATEST__HOME=/home/jenkins/tools/java/latest1.7
Setting JDK_1_7_LATEST__HOME=/home/jenkins/tools/java/latest1.7
[description-setter] Description set: ZOOKEEPER-2932
Putting comment on the pull request
Setting JDK_1_7_LATEST__HOME=/home/jenkins/tools/java/latest1.7
Email was triggered for: Failure - Any
Sending email for trigger: Failure - Any
Setting JDK_1_7_LATEST__HOME=/home/jenkins/tools/java/latest1.7
Setting JDK_1_7_LATEST__HOME=/home/jenkins/tools/java/latest1.7
Setting JDK_1_7_LATEST__HOME=/home/jenkins/tools/java/latest1.7



###################################################################################
############################## FAILED TESTS (if any) ##############################
35 tests failed.
FAILED:  org.apache.zookeeper.server.quorum.QuorumPeerMainTest.testEarlyLeaderAbandonment

Error Message:
Waiting too long

Stack Trace:
java.lang.RuntimeException: Waiting too long
	at org.apache.zookeeper.server.quorum.QuorumPeerMainTest.waitForAll(QuorumPeerMainTest.java:354)
	at org.apache.zookeeper.server.quorum.QuorumPeerMainTest.testEarlyLeaderAbandonment(QuorumPeerMainTest.java:176)
	at org.apache.zookeeper.JUnit4ZKTestRunner$LoggedInvokeMethod.evaluate(JUnit4ZKTestRunner.java:79)


FAILED:  org.apache.zookeeper.server.quorum.QuorumPeerMainTest.testHighestZxidJoinLate

Error Message:
Waiting too long

Stack Trace:
java.lang.RuntimeException: Waiting too long
	at org.apache.zookeeper.server.quorum.QuorumPeerMainTest.waitForOne(QuorumPeerMainTest.java:342)
	at org.apache.zookeeper.server.quorum.QuorumPeerMainTest.testHighestZxidJoinLate(QuorumPeerMainTest.java:306)
	at org.apache.zookeeper.JUnit4ZKTestRunner$LoggedInvokeMethod.evaluate(JUnit4ZKTestRunner.java:79)


FAILED:  org.apache.zookeeper.server.quorum.ReconfigLegacyTest.testRestartZooKeeperServer

Error Message:
waiting for server 0 being up

Stack Trace:
junit.framework.AssertionFailedError: waiting for server 0 being up
	at org.apache.zookeeper.server.quorum.ReconfigLegacyTest.testRestartZooKeeperServer(ReconfigLegacyTest.java:299)
	at org.apache.zookeeper.JUnit4ZKTestRunner$LoggedInvokeMethod.evaluate(JUnit4ZKTestRunner.java:79)
	at java.util.concurrent.FutureTask.run(FutureTask.java:262)
	at java.lang.Thread.run(Thread.java:745)


FAILED:  org.apache.zookeeper.server.quorum.ReconfigLegacyTest.testConfigFileBackwardCompatibility

Error Message:
waiting for server 0 being up

Stack Trace:
junit.framework.AssertionFailedError: waiting for server 0 being up
	at org.apache.zookeeper.server.quorum.ReconfigLegacyTest.testConfigFileBackwardCompatibility(ReconfigLegacyTest.java:129)
	at org.apache.zookeeper.JUnit4ZKTestRunner$LoggedInvokeMethod.evaluate(JUnit4ZKTestRunner.java:79)


FAILED:  org.apache.zookeeper.server.quorum.ReconfigRollingRestartCompatibilityTest.testRollingRestartWithoutMembershipChange

Error Message:
ZooKeeper client can not connect to 127.0.0.1:27395

Stack Trace:
junit.framework.AssertionFailedError: ZooKeeper client can not connect to 127.0.0.1:27395
	at org.apache.zookeeper.test.ClientBase.createZKClient(ClientBase.java:761)
	at org.apache.zookeeper.test.ClientBase.createZKClient(ClientBase.java:742)
	at org.apache.zookeeper.server.quorum.ReconfigRollingRestartCompatibilityTest.verifyQuorumConfig(ReconfigRollingRestartCompatibilityTest.java:230)
	at org.apache.zookeeper.server.quorum.ReconfigRollingRestartCompatibilityTest.testRollingRestartWithoutMembershipChange(ReconfigRollingRestartCompatibilityTest.java:152)
	at org.apache.zookeeper.JUnit4ZKTestRunner$LoggedInvokeMethod.evaluate(JUnit4ZKTestRunner.java:79)
	at java.util.concurrent.FutureTask.run(FutureTask.java:262)
	at java.lang.Thread.run(Thread.java:745)


FAILED:  org.apache.zookeeper.test.ACLTest.testAcls

Error Message:
Transaction log: /home/jenkins/jenkins-slave/workspace/PreCommit-ZOOKEEPER-github-pr-build/build/test/tmp/test7900339981226103254.junit.dir/version-2/snapshot.0 has invalid magic number 1514885966 != 1514884167

Stack Trace:
java.io.IOException: Transaction log: /home/jenkins/jenkins-slave/workspace/PreCommit-ZOOKEEPER-github-pr-build/build/test/tmp/test7900339981226103254.junit.dir/version-2/snapshot.0 has invalid magic number 1514885966 != 1514884167
	at org.apache.zookeeper.server.persistence.FileTxnLog$FileTxnIterator.inStreamCreated(FileTxnLog.java:626)
	at org.apache.zookeeper.server.persistence.FileTxnLog$FileTxnIterator.createInputArchive(FileTxnLog.java:643)
	at org.apache.zookeeper.server.persistence.FileTxnLog$FileTxnIterator.goToNextLog(FileTxnLog.java:609)
	at org.apache.zookeeper.server.persistence.FileTxnLog$FileTxnIterator.init(FileTxnLog.java:585)
	at org.apache.zookeeper.server.persistence.FileTxnLog$FileTxnIterator.<init>(FileTxnLog.java:547)
	at org.apache.zookeeper.server.persistence.FileTxnLog.read(FileTxnLog.java:369)
	at org.apache.zookeeper.server.persistence.FileTxnLog.read(FileTxnLog.java:356)
	at org.apache.zookeeper.server.persistence.FileTxnSnapLog.restore(FileTxnSnapLog.java:210)
	at org.apache.zookeeper.server.ZKDatabase.loadDataBase(ZKDatabase.java:243)
	at org.apache.zookeeper.server.ZooKeeperServer.loadData(ZooKeeperServer.java:283)
	at org.apache.zookeeper.server.ZooKeeperServer.startdata(ZooKeeperServer.java:447)
	at org.apache.zookeeper.server.NIOServerCnxnFactory.startup(NIOServerCnxnFactory.java:764)
	at org.apache.zookeeper.server.ServerCnxnFactory.startup(ServerCnxnFactory.java:98)
	at org.apache.zookeeper.test.ACLTest.testAcls(ACLTest.java:146)
	at org.apache.zookeeper.JUnit4ZKTestRunner$LoggedInvokeMethod.evaluate(JUnit4ZKTestRunner.java:79)


FAILED:  org.apache.zookeeper.test.ACLTest.testNullValueACL

Error Message:
Address already in use

Stack Trace:
java.net.BindException: Address already in use
	at sun.nio.ch.Net.bind0(Native Method)
	at sun.nio.ch.Net.bind(Net.java:463)
	at sun.nio.ch.Net.bind(Net.java:455)
	at sun.nio.ch.ServerSocketChannelImpl.bind(ServerSocketChannelImpl.java:223)
	at sun.nio.ch.ServerSocketAdaptor.bind(ServerSocketAdaptor.java:74)
	at sun.nio.ch.ServerSocketAdaptor.bind(ServerSocketAdaptor.java:67)
	at org.apache.zookeeper.server.NIOServerCnxnFactory.configure(NIOServerCnxnFactory.java:687)
	at org.apache.zookeeper.server.ServerCnxnFactory.configure(ServerCnxnFactory.java:76)
	at org.apache.zookeeper.server.ServerCnxnFactory.createFactory(ServerCnxnFactory.java:155)
	at org.apache.zookeeper.server.ServerCnxnFactory.createFactory(ServerCnxnFactory.java:148)
	at org.apache.zookeeper.test.ACLTest.testNullValueACL(ACLTest.java:243)
	at org.apache.zookeeper.JUnit4ZKTestRunner$LoggedInvokeMethod.evaluate(JUnit4ZKTestRunner.java:79)


FAILED:  org.apache.zookeeper.test.ACLTest.testDisconnectedAddAuth

Error Message:
Address already in use

Stack Trace:
java.net.BindException: Address already in use
	at sun.nio.ch.Net.bind0(Native Method)
	at sun.nio.ch.Net.bind(Net.java:463)
	at sun.nio.ch.Net.bind(Net.java:455)
	at sun.nio.ch.ServerSocketChannelImpl.bind(ServerSocketChannelImpl.java:223)
	at sun.nio.ch.ServerSocketAdaptor.bind(ServerSocketAdaptor.java:74)
	at sun.nio.ch.ServerSocketAdaptor.bind(ServerSocketAdaptor.java:67)
	at org.apache.zookeeper.server.NIOServerCnxnFactory.configure(NIOServerCnxnFactory.java:687)
	at org.apache.zookeeper.server.ServerCnxnFactory.configure(ServerCnxnFactory.java:76)
	at org.apache.zookeeper.server.ServerCnxnFactory.createFactory(ServerCnxnFactory.java:155)
	at org.apache.zookeeper.server.ServerCnxnFactory.createFactory(ServerCnxnFactory.java:148)
	at org.apache.zookeeper.test.ACLTest.testDisconnectedAddAuth(ACLTest.java:71)
	at org.apache.zookeeper.JUnit4ZKTestRunner$LoggedInvokeMethod.evaluate(JUnit4ZKTestRunner.java:79)


FAILED:  org.apache.zookeeper.test.ACLTest.testNullACL

Error Message:
Address already in use

Stack Trace:
java.net.BindException: Address already in use
	at sun.nio.ch.Net.bind0(Native Method)
	at sun.nio.ch.Net.bind(Net.java:463)
	at sun.nio.ch.Net.bind(Net.java:455)
	at sun.nio.ch.ServerSocketChannelImpl.bind(ServerSocketChannelImpl.java:223)
	at sun.nio.ch.ServerSocketAdaptor.bind(ServerSocketAdaptor.java:74)
	at sun.nio.ch.ServerSocketAdaptor.bind(ServerSocketAdaptor.java:67)
	at org.apache.zookeeper.server.NIOServerCnxnFactory.configure(NIOServerCnxnFactory.java:687)
	at org.apache.zookeeper.server.ServerCnxnFactory.configure(ServerCnxnFactory.java:76)
	at org.apache.zookeeper.server.ServerCnxnFactory.createFactory(ServerCnxnFactory.java:155)
	at org.apache.zookeeper.server.ServerCnxnFactory.createFactory(ServerCnxnFactory.java:148)
	at org.apache.zookeeper.test.ACLTest.testNullACL(ACLTest.java:201)
	at org.apache.zookeeper.JUnit4ZKTestRunner$LoggedInvokeMethod.evaluate(JUnit4ZKTestRunner.java:79)


FAILED:  org.apache.zookeeper.test.AsyncHammerTest.testHammer

Error Message:
Unable to run quorum server 

Stack Trace:
java.lang.RuntimeException: Unable to run quorum server 
	at org.apache.zookeeper.server.quorum.QuorumPeer.loadDataBase(QuorumPeer.java:822)
	at org.apache.zookeeper.server.quorum.QuorumPeer.start(QuorumPeer.java:771)
	at org.apache.zookeeper.test.QuorumBase.startServers(QuorumBase.java:211)
	at org.apache.zookeeper.test.QuorumBase.startServers(QuorumBase.java:133)
	at org.apache.zookeeper.test.AsyncHammerTest.restart(AsyncHammerTest.java:61)
	at org.apache.zookeeper.test.AsyncHammerTest.testHammer(AsyncHammerTest.java:192)
	at org.apache.zookeeper.JUnit4ZKTestRunner$LoggedInvokeMethod.evaluate(JUnit4ZKTestRunner.java:79)
Caused by: java.io.EOFException
	at java.io.DataInputStream.readInt(DataInputStream.java:392)
	at org.apache.jute.BinaryInputArchive.readInt(BinaryInputArchive.java:63)
	at org.apache.zookeeper.server.persistence.FileHeader.deserialize(FileHeader.java:66)
	at org.apache.zookeeper.server.persistence.FileTxnLog$FileTxnIterator.inStreamCreated(FileTxnLog.java:624)
	at org.apache.zookeeper.server.persistence.FileTxnLog$FileTxnIterator.createInputArchive(FileTxnLog.java:643)
	at org.apache.zookeeper.server.persistence.FileTxnLog$FileTxnIterator.goToNextLog(FileTxnLog.java:609)
	at org.apache.zookeeper.server.persistence.FileTxnLog$FileTxnIterator.init(FileTxnLog.java:585)
	at org.apache.zookeeper.server.persistence.FileTxnLog$FileTxnIterator.<init>(FileTxnLog.java:547)
	at org.apache.zookeeper.server.persistence.FileTxnLog.read(FileTxnLog.java:369)
	at org.apache.zookeeper.server.persistence.FileTxnLog.read(FileTxnLog.java:356)
	at org.apache.zookeeper.server.persistence.FileTxnSnapLog.restore(FileTxnSnapLog.java:210)
	at org.apache.zookeeper.server.ZKDatabase.loadDataBase(ZKDatabase.java:243)
	at org.apache.zookeeper.server.quorum.QuorumPeer.loadDataBase(QuorumPeer.java:785)


FAILED:  org.apache.zookeeper.test.BufferSizeTest.testStartup

Error Message:
Transaction log: /home/jenkins/jenkins-slave/workspace/PreCommit-ZOOKEEPER-github-pr-build/build/test/tmp/test5368299265116378276.junit.dir/version-2/snapshot.0 has invalid magic number 1514885966 != 1514884167

Stack Trace:
java.io.IOException: Transaction log: /home/jenkins/jenkins-slave/workspace/PreCommit-ZOOKEEPER-github-pr-build/build/test/tmp/test5368299265116378276.junit.dir/version-2/snapshot.0 has invalid magic number 1514885966 != 1514884167
	at org.apache.zookeeper.server.persistence.FileTxnLog$FileTxnIterator.inStreamCreated(FileTxnLog.java:626)
	at org.apache.zookeeper.server.persistence.FileTxnLog$FileTxnIterator.createInputArchive(FileTxnLog.java:643)
	at org.apache.zookeeper.server.persistence.FileTxnLog$FileTxnIterator.goToNextLog(FileTxnLog.java:609)
	at org.apache.zookeeper.server.persistence.FileTxnLog$FileTxnIterator.init(FileTxnLog.java:585)
	at org.apache.zookeeper.server.persistence.FileTxnLog$FileTxnIterator.<init>(FileTxnLog.java:547)
	at org.apache.zookeeper.server.persistence.FileTxnLog.read(FileTxnLog.java:369)
	at org.apache.zookeeper.server.persistence.FileTxnLog.read(FileTxnLog.java:356)
	at org.apache.zookeeper.server.persistence.FileTxnSnapLog.restore(FileTxnSnapLog.java:210)
	at org.apache.zookeeper.server.ZKDatabase.loadDataBase(ZKDatabase.java:243)
	at org.apache.zookeeper.server.ZooKeeperServer.loadData(ZooKeeperServer.java:283)
	at org.apache.zookeeper.server.ZooKeeperServer.startdata(ZooKeeperServer.java:447)
	at org.apache.zookeeper.server.NIOServerCnxnFactory.startup(NIOServerCnxnFactory.java:764)
	at org.apache.zookeeper.server.ServerCnxnFactory.startup(ServerCnxnFactory.java:98)
	at org.apache.zookeeper.test.ClientBase.startServerInstance(ClientBase.java:421)
	at org.apache.zookeeper.test.ClientBase.startServer(ClientBase.java:527)
	at org.apache.zookeeper.test.BufferSizeTest.testStartup(BufferSizeTest.java:97)
	at org.apache.zookeeper.JUnit4ZKTestRunner$LoggedInvokeMethod.evaluate(JUnit4ZKTestRunner.java:79)


FAILED:  org.apache.zookeeper.test.CnxManagerTest.testWorkerThreads

Error Message:
Unable to run quorum server 

Stack Trace:
java.lang.RuntimeException: Unable to run quorum server 
	at org.apache.zookeeper.server.quorum.QuorumPeer.loadDataBase(QuorumPeer.java:822)
	at org.apache.zookeeper.server.quorum.QuorumPeer.start(QuorumPeer.java:771)
	at org.apache.zookeeper.test.CnxManagerTest.testWorkerThreads(CnxManagerTest.java:399)
	at org.apache.zookeeper.JUnit4ZKTestRunner$LoggedInvokeMethod.evaluate(JUnit4ZKTestRunner.java:79)
Caused by: java.io.EOFException
	at java.io.DataInputStream.readInt(DataInputStream.java:392)
	at org.apache.jute.BinaryInputArchive.readInt(BinaryInputArchive.java:63)
	at org.apache.zookeeper.server.persistence.FileHeader.deserialize(FileHeader.java:66)
	at org.apache.zookeeper.server.persistence.FileTxnLog$FileTxnIterator.inStreamCreated(FileTxnLog.java:624)
	at org.apache.zookeeper.server.persistence.FileTxnLog$FileTxnIterator.createInputArchive(FileTxnLog.java:643)
	at org.apache.zookeeper.server.persistence.FileTxnLog$FileTxnIterator.goToNextLog(FileTxnLog.java:609)
	at org.apache.zookeeper.server.persistence.FileTxnLog$FileTxnIterator.init(FileTxnLog.java:585)
	at org.apache.zookeeper.server.persistence.FileTxnLog$FileTxnIterator.<init>(FileTxnLog.java:547)
	at org.apache.zookeeper.server.persistence.FileTxnLog.read(FileTxnLog.java:369)
	at org.apache.zookeeper.server.persistence.FileTxnLog.read(FileTxnLog.java:356)
	at org.apache.zookeeper.server.persistence.FileTxnSnapLog.restore(FileTxnSnapLog.java:210)
	at org.apache.zookeeper.server.ZKDatabase.loadDataBase(ZKDatabase.java:243)
	at org.apache.zookeeper.server.quorum.QuorumPeer.loadDataBase(QuorumPeer.java:785)


FAILED:  org.apache.zookeeper.test.DisconnectedWatcherTest.testDeepChildWatcherAutoResetWithChroot

Error Message:
Transaction log: /home/jenkins/jenkins-slave/workspace/PreCommit-ZOOKEEPER-github-pr-build/build/test/tmp/test326030939592483183.junit.dir/version-2/snapshot.0 has invalid magic number 1514885966 != 1514884167

Stack Trace:
java.io.IOException: Transaction log: /home/jenkins/jenkins-slave/workspace/PreCommit-ZOOKEEPER-github-pr-build/build/test/tmp/test326030939592483183.junit.dir/version-2/snapshot.0 has invalid magic number 1514885966 != 1514884167
	at org.apache.zookeeper.server.persistence.FileTxnLog$FileTxnIterator.inStreamCreated(FileTxnLog.java:626)
	at org.apache.zookeeper.server.persistence.FileTxnLog$FileTxnIterator.createInputArchive(FileTxnLog.java:643)
	at org.apache.zookeeper.server.persistence.FileTxnLog$FileTxnIterator.goToNextLog(FileTxnLog.java:609)
	at org.apache.zookeeper.server.persistence.FileTxnLog$FileTxnIterator.init(FileTxnLog.java:585)
	at org.apache.zookeeper.server.persistence.FileTxnLog$FileTxnIterator.<init>(FileTxnLog.java:547)
	at org.apache.zookeeper.server.persistence.FileTxnLog.read(FileTxnLog.java:369)
	at org.apache.zookeeper.server.persistence.FileTxnLog.read(FileTxnLog.java:356)
	at org.apache.zookeeper.server.persistence.FileTxnSnapLog.restore(FileTxnSnapLog.java:210)
	at org.apache.zookeeper.server.ZKDatabase.loadDataBase(ZKDatabase.java:243)
	at org.apache.zookeeper.server.ZooKeeperServer.loadData(ZooKeeperServer.java:283)
	at org.apache.zookeeper.server.ZooKeeperServer.startdata(ZooKeeperServer.java:447)
	at org.apache.zookeeper.server.NIOServerCnxnFactory.startup(NIOServerCnxnFactory.java:764)
	at org.apache.zookeeper.server.ServerCnxnFactory.startup(ServerCnxnFactory.java:98)
	at org.apache.zookeeper.test.ClientBase.startServerInstance(ClientBase.java:421)
	at org.apache.zookeeper.test.ClientBase.startServer(ClientBase.java:527)
	at org.apache.zookeeper.test.DisconnectedWatcherTest.testDeepChildWatcherAutoResetWithChroot(DisconnectedWatcherTest.java:167)
	at org.apache.zookeeper.JUnit4ZKTestRunner$LoggedInvokeMethod.evaluate(JUnit4ZKTestRunner.java:79)


FAILED:  org.apache.zookeeper.test.DisconnectedWatcherTest.testChildWatcherAutoResetWithChroot

Error Message:
Transaction log: /home/jenkins/jenkins-slave/workspace/PreCommit-ZOOKEEPER-github-pr-build/build/test/tmp/test6517954356577650015.junit.dir/version-2/snapshot.0 has invalid magic number 1514885966 != 1514884167

Stack Trace:
java.io.IOException: Transaction log: /home/jenkins/jenkins-slave/workspace/PreCommit-ZOOKEEPER-github-pr-build/build/test/tmp/test6517954356577650015.junit.dir/version-2/snapshot.0 has invalid magic number 1514885966 != 1514884167
	at org.apache.zookeeper.server.persistence.FileTxnLog$FileTxnIterator.inStreamCreated(FileTxnLog.java:626)
	at org.apache.zookeeper.server.persistence.FileTxnLog$FileTxnIterator.createInputArchive(FileTxnLog.java:643)
	at org.apache.zookeeper.server.persistence.FileTxnLog$FileTxnIterator.goToNextLog(FileTxnLog.java:609)
	at org.apache.zookeeper.server.persistence.FileTxnLog$FileTxnIterator.init(FileTxnLog.java:585)
	at org.apache.zookeeper.server.persistence.FileTxnLog$FileTxnIterator.<init>(FileTxnLog.java:547)
	at org.apache.zookeeper.server.persistence.FileTxnLog.read(FileTxnLog.java:369)
	at org.apache.zookeeper.server.persistence.FileTxnLog.read(FileTxnLog.java:356)
	at org.apache.zookeeper.server.persistence.FileTxnSnapLog.restore(FileTxnSnapLog.java:210)
	at org.apache.zookeeper.server.ZKDatabase.loadDataBase(ZKDatabase.java:243)
	at org.apache.zookeeper.server.ZooKeeperServer.loadData(ZooKeeperServer.java:283)
	at org.apache.zookeeper.server.ZooKeeperServer.startdata(ZooKeeperServer.java:447)
	at org.apache.zookeeper.server.NIOServerCnxnFactory.startup(NIOServerCnxnFactory.java:764)
	at org.apache.zookeeper.server.ServerCnxnFactory.startup(ServerCnxnFactory.java:98)
	at org.apache.zookeeper.test.ClientBase.startServerInstance(ClientBase.java:421)
	at org.apache.zookeeper.test.ClientBase.startServer(ClientBase.java:527)
	at org.apache.zookeeper.test.DisconnectedWatcherTest.testChildWatcherAutoResetWithChroot(DisconnectedWatcherTest.java:86)
	at org.apache.zookeeper.JUnit4ZKTestRunner$LoggedInvokeMethod.evaluate(JUnit4ZKTestRunner.java:79)


FAILED:  org.apache.zookeeper.test.DisconnectedWatcherTest.testDefaultWatcherAutoResetWithChroot

Error Message:
Transaction log: /home/jenkins/jenkins-slave/workspace/PreCommit-ZOOKEEPER-github-pr-build/build/test/tmp/test7551825318086012615.junit.dir/version-2/snapshot.0 has invalid magic number 1514885966 != 1514884167

Stack Trace:
java.io.IOException: Transaction log: /home/jenkins/jenkins-slave/workspace/PreCommit-ZOOKEEPER-github-pr-build/build/test/tmp/test7551825318086012615.junit.dir/version-2/snapshot.0 has invalid magic number 1514885966 != 1514884167
	at org.apache.zookeeper.server.persistence.FileTxnLog$FileTxnIterator.inStreamCreated(FileTxnLog.java:626)
	at org.apache.zookeeper.server.persistence.FileTxnLog$FileTxnIterator.createInputArchive(FileTxnLog.java:643)
	at org.apache.zookeeper.server.persistence.FileTxnLog$FileTxnIterator.goToNextLog(FileTxnLog.java:609)
	at org.apache.zookeeper.server.persistence.FileTxnLog$FileTxnIterator.init(FileTxnLog.java:585)
	at org.apache.zookeeper.server.persistence.FileTxnLog$FileTxnIterator.<init>(FileTxnLog.java:547)
	at org.apache.zookeeper.server.persistence.FileTxnLog.read(FileTxnLog.java:369)
	at org.apache.zookeeper.server.persistence.FileTxnLog.read(FileTxnLog.java:356)
	at org.apache.zookeeper.server.persistence.FileTxnSnapLog.restore(FileTxnSnapLog.java:210)
	at org.apache.zookeeper.server.ZKDatabase.loadDataBase(ZKDatabase.java:243)
	at org.apache.zookeeper.server.ZooKeeperServer.loadData(ZooKeeperServer.java:283)
	at org.apache.zookeeper.server.ZooKeeperServer.startdata(ZooKeeperServer.java:447)
	at org.apache.zookeeper.server.NIOServerCnxnFactory.startup(NIOServerCnxnFactory.java:764)
	at org.apache.zookeeper.server.ServerCnxnFactory.startup(ServerCnxnFactory.java:98)
	at org.apache.zookeeper.test.ClientBase.startServerInstance(ClientBase.java:421)
	at org.apache.zookeeper.test.ClientBase.startServer(ClientBase.java:527)
	at org.apache.zookeeper.test.DisconnectedWatcherTest.testDefaultWatcherAutoResetWithChroot(DisconnectedWatcherTest.java:125)
	at org.apache.zookeeper.JUnit4ZKTestRunner$LoggedInvokeMethod.evaluate(JUnit4ZKTestRunner.java:79)


FAILED:  org.apache.zookeeper.test.DisconnectedWatcherTest.testManyChildWatchersAutoReset

Error Message:
Transaction log: /home/jenkins/jenkins-slave/workspace/PreCommit-ZOOKEEPER-github-pr-build/build/test/tmp/test4556510124232021560.junit.dir/version-2/snapshot.0 has invalid magic number 1514885966 != 1514884167

Stack Trace:
java.io.IOException: Transaction log: /home/jenkins/jenkins-slave/workspace/PreCommit-ZOOKEEPER-github-pr-build/build/test/tmp/test4556510124232021560.junit.dir/version-2/snapshot.0 has invalid magic number 1514885966 != 1514884167
	at org.apache.zookeeper.server.persistence.FileTxnLog$FileTxnIterator.inStreamCreated(FileTxnLog.java:626)
	at org.apache.zookeeper.server.persistence.FileTxnLog$FileTxnIterator.createInputArchive(FileTxnLog.java:643)
	at org.apache.zookeeper.server.persistence.FileTxnLog$FileTxnIterator.goToNextLog(FileTxnLog.java:609)
	at org.apache.zookeeper.server.persistence.FileTxnLog$FileTxnIterator.init(FileTxnLog.java:585)
	at org.apache.zookeeper.server.persistence.FileTxnLog$FileTxnIterator.<init>(FileTxnLog.java:547)
	at org.apache.zookeeper.server.persistence.FileTxnLog.read(FileTxnLog.java:369)
	at org.apache.zookeeper.server.persistence.FileTxnLog.read(FileTxnLog.java:356)
	at org.apache.zookeeper.server.persistence.FileTxnSnapLog.restore(FileTxnSnapLog.java:210)
	at org.apache.zookeeper.server.ZKDatabase.loadDataBase(ZKDatabase.java:243)
	at org.apache.zookeeper.server.ZooKeeperServer.loadData(ZooKeeperServer.java:283)
	at org.apache.zookeeper.server.ZooKeeperServer.startdata(ZooKeeperServer.java:447)
	at org.apache.zookeeper.server.NIOServerCnxnFactory.startup(NIOServerCnxnFactory.java:764)
	at org.apache.zookeeper.server.ServerCnxnFactory.startup(ServerCnxnFactory.java:98)
	at org.apache.zookeeper.test.ClientBase.startServerInstance(ClientBase.java:421)
	at org.apache.zookeeper.test.ClientBase.startServer(ClientBase.java:527)
	at org.apache.zookeeper.test.DisconnectedWatcherTest.testManyChildWatchersAutoReset(DisconnectedWatcherTest.java:221)
	at org.apache.zookeeper.JUnit4ZKTestRunner$LoggedInvokeMethod.evaluate(JUnit4ZKTestRunner.java:79)


FAILED:  org.apache.zookeeper.test.FLERestartTest.testLERestart

Error Message:
null

Stack Trace:
java.lang.NullPointerException
	at org.apache.zookeeper.test.FLERestartTest.tearDown(FLERestartTest.java:84)


FAILED:  org.apache.zookeeper.test.FollowerResyncConcurrencyTest.testResyncByTxnlogThenDiffAfterFollowerCrashes

Error Message:
Unable to run quorum server 

Stack Trace:
java.lang.RuntimeException: Unable to run quorum server 
	at org.apache.zookeeper.server.quorum.QuorumPeer.loadDataBase(QuorumPeer.java:822)
	at org.apache.zookeeper.server.quorum.QuorumPeer.start(QuorumPeer.java:771)
	at org.apache.zookeeper.test.QuorumUtil.start(QuorumUtil.java:211)
	at org.apache.zookeeper.test.QuorumUtil.restart(QuorumUtil.java:215)
	at org.apache.zookeeper.test.FollowerResyncConcurrencyTest.followerResyncCrashTest(FollowerResyncConcurrencyTest.java:237)
	at org.apache.zookeeper.test.FollowerResyncConcurrencyTest.testResyncByTxnlogThenDiffAfterFollowerCrashes(FollowerResyncConcurrencyTest.java:191)
	at org.apache.zookeeper.JUnit4ZKTestRunner$LoggedInvokeMethod.evaluate(JUnit4ZKTestRunner.java:79)
Caused by: java.io.EOFException
	at java.io.DataInputStream.readInt(DataInputStream.java:392)
	at org.apache.jute.BinaryInputArchive.readInt(BinaryInputArchive.java:63)
	at org.apache.zookeeper.server.persistence.FileHeader.deserialize(FileHeader.java:66)
	at org.apache.zookeeper.server.persistence.FileTxnLog$FileTxnIterator.inStreamCreated(FileTxnLog.java:624)
	at org.apache.zookeeper.server.persistence.FileTxnLog$FileTxnIterator.createInputArchive(FileTxnLog.java:643)
	at org.apache.zookeeper.server.persistence.FileTxnLog$FileTxnIterator.goToNextLog(FileTxnLog.java:609)
	at org.apache.zookeeper.server.persistence.FileTxnLog$FileTxnIterator.init(FileTxnLog.java:585)
	at org.apache.zookeeper.server.persistence.FileTxnLog$FileTxnIterator.<init>(FileTxnLog.java:547)
	at org.apache.zookeeper.server.persistence.FileTxnLog.read(FileTxnLog.java:369)
	at org.apache.zookeeper.server.persistence.FileTxnLog.read(FileTxnLog.java:356)
	at org.apache.zookeeper.server.persistence.FileTxnSnapLog.restore(FileTxnSnapLog.java:210)
	at org.apache.zookeeper.server.ZKDatabase.loadDataBase(ZKDatabase.java:243)
	at org.apache.zookeeper.server.quorum.QuorumPeer.loadDataBase(QuorumPeer.java:785)


FAILED:  org.apache.zookeeper.test.FollowerResyncConcurrencyTest.testLaggingFollowerResyncsUnderNewEpoch

Error Message:
Unable to run quorum server 

Stack Trace:
java.lang.RuntimeException: Unable to run quorum server 
	at org.apache.zookeeper.server.quorum.QuorumPeer.loadDataBase(QuorumPeer.java:822)
	at org.apache.zookeeper.server.quorum.QuorumPeer.start(QuorumPeer.java:771)
	at org.apache.zookeeper.test.QuorumUtil.start(QuorumUtil.java:211)
	at org.apache.zookeeper.test.FollowerResyncConcurrencyTest.testLaggingFollowerResyncsUnderNewEpoch(FollowerResyncConcurrencyTest.java:124)
	at org.apache.zookeeper.JUnit4ZKTestRunner$LoggedInvokeMethod.evaluate(JUnit4ZKTestRunner.java:79)
Caused by: java.io.EOFException
	at java.io.DataInputStream.readInt(DataInputStream.java:392)
	at org.apache.jute.BinaryInputArchive.readInt(BinaryInputArchive.java:63)
	at org.apache.zookeeper.server.persistence.FileHeader.deserialize(FileHeader.java:66)
	at org.apache.zookeeper.server.persistence.FileTxnLog$FileTxnIterator.inStreamCreated(FileTxnLog.java:624)
	at org.apache.zookeeper.server.persistence.FileTxnLog$FileTxnIterator.createInputArchive(FileTxnLog.java:643)
	at org.apache.zookeeper.server.persistence.FileTxnLog$FileTxnIterator.goToNextLog(FileTxnLog.java:609)
	at org.apache.zookeeper.server.persistence.FileTxnLog$FileTxnIterator.init(FileTxnLog.java:585)
	at org.apache.zookeeper.server.persistence.FileTxnLog$FileTxnIterator.<init>(FileTxnLog.java:547)
	at org.apache.zookeeper.server.persistence.FileTxnLog.read(FileTxnLog.java:369)
	at org.apache.zookeeper.server.persistence.FileTxnLog.read(FileTxnLog.java:356)
	at org.apache.zookeeper.server.persistence.FileTxnSnapLog.restore(FileTxnSnapLog.java:210)
	at org.apache.zookeeper.server.ZKDatabase.loadDataBase(ZKDatabase.java:243)
	at org.apache.zookeeper.server.quorum.QuorumPeer.loadDataBase(QuorumPeer.java:785)


FAILED:  org.apache.zookeeper.test.FollowerResyncConcurrencyTest.testResyncByDiffAfterFollowerCrashes

Error Message:
Unable to run quorum server 

Stack Trace:
java.lang.RuntimeException: Unable to run quorum server 
	at org.apache.zookeeper.server.quorum.QuorumPeer.loadDataBase(QuorumPeer.java:822)
	at org.apache.zookeeper.server.quorum.QuorumPeer.start(QuorumPeer.java:771)
	at org.apache.zookeeper.test.QuorumUtil.startThenShutdown(QuorumUtil.java:230)
	at org.apache.zookeeper.test.FollowerResyncConcurrencyTest.testResyncByDiffAfterFollowerCrashes(FollowerResyncConcurrencyTest.java:490)
	at org.apache.zookeeper.JUnit4ZKTestRunner$LoggedInvokeMethod.evaluate(JUnit4ZKTestRunner.java:79)
Caused by: java.io.EOFException
	at java.io.DataInputStream.readInt(DataInputStream.java:392)
	at org.apache.jute.BinaryInputArchive.readInt(BinaryInputArchive.java:63)
	at org.apache.zookeeper.server.persistence.FileHeader.deserialize(FileHeader.java:66)
	at org.apache.zookeeper.server.persistence.FileTxnLog$FileTxnIterator.inStreamCreated(FileTxnLog.java:624)
	at org.apache.zookeeper.server.persistence.FileTxnLog$FileTxnIterator.createInputArchive(FileTxnLog.java:643)
	at org.apache.zookeeper.server.persistence.FileTxnLog$FileTxnIterator.goToNextLog(FileTxnLog.java:609)
	at org.apache.zookeeper.server.persistence.FileTxnLog$FileTxnIterator.init(FileTxnLog.java:585)
	at org.apache.zookeeper.server.persistence.FileTxnLog$FileTxnIterator.<init>(FileTxnLog.java:547)
	at org.apache.zookeeper.server.persistence.FileTxnLog.read(FileTxnLog.java:369)
	at org.apache.zookeeper.server.persistence.FileTxnLog.read(FileTxnLog.java:356)
	at org.apache.zookeeper.server.persistence.FileTxnSnapLog.restore(FileTxnSnapLog.java:210)
	at org.apache.zookeeper.server.ZKDatabase.loadDataBase(ZKDatabase.java:243)
	at org.apache.zookeeper.server.quorum.QuorumPeer.loadDataBase(QuorumPeer.java:785)


FAILED:  org.apache.zookeeper.test.FollowerResyncConcurrencyTest.testResyncBySnapThenDiffAfterFollowerCrashes

Error Message:
Unable to run quorum server 

Stack Trace:
java.lang.RuntimeException: Unable to run quorum server 
	at org.apache.zookeeper.server.quorum.QuorumPeer.loadDataBase(QuorumPeer.java:822)
	at org.apache.zookeeper.server.quorum.QuorumPeer.start(QuorumPeer.java:771)
	at org.apache.zookeeper.test.QuorumUtil.start(QuorumUtil.java:211)
	at org.apache.zookeeper.test.QuorumUtil.restart(QuorumUtil.java:215)
	at org.apache.zookeeper.test.FollowerResyncConcurrencyTest.followerResyncCrashTest(FollowerResyncConcurrencyTest.java:237)
	at org.apache.zookeeper.test.FollowerResyncConcurrencyTest.testResyncBySnapThenDiffAfterFollowerCrashes(FollowerResyncConcurrencyTest.java:176)
	at org.apache.zookeeper.JUnit4ZKTestRunner$LoggedInvokeMethod.evaluate(JUnit4ZKTestRunner.java:79)
Caused by: java.io.EOFException
	at java.io.DataInputStream.readInt(DataInputStream.java:392)
	at org.apache.jute.BinaryInputArchive.readInt(BinaryInputArchive.java:63)
	at org.apache.zookeeper.server.persistence.FileHeader.deserialize(FileHeader.java:66)
	at org.apache.zookeeper.server.persistence.FileTxnLog$FileTxnIterator.inStreamCreated(FileTxnLog.java:624)
	at org.apache.zookeeper.server.persistence.FileTxnLog$FileTxnIterator.createInputArchive(FileTxnLog.java:643)
	at org.apache.zookeeper.server.persistence.FileTxnLog$FileTxnIterator.goToNextLog(FileTxnLog.java:609)
	at org.apache.zookeeper.server.persistence.FileTxnLog$FileTxnIterator.init(FileTxnLog.java:585)
	at org.apache.zookeeper.server.persistence.FileTxnLog$FileTxnIterator.<init>(FileTxnLog.java:547)
	at org.apache.zookeeper.server.persistence.FileTxnLog.read(FileTxnLog.java:369)
	at org.apache.zookeeper.server.persistence.FileTxnLog.read(FileTxnLog.java:356)
	at org.apache.zookeeper.server.persistence.FileTxnSnapLog.restore(FileTxnSnapLog.java:210)
	at org.apache.zookeeper.server.ZKDatabase.loadDataBase(ZKDatabase.java:243)
	at org.apache.zookeeper.server.quorum.QuorumPeer.loadDataBase(QuorumPeer.java:785)


FAILED:  org.apache.zookeeper.test.FourLetterWordsWhiteListTest.testISROEnabledWhenReadOnlyModeEnabled

Error Message:
Transaction log: /home/jenkins/jenkins-slave/workspace/PreCommit-ZOOKEEPER-github-pr-build/build/test/tmp/test8869432496219622507.junit.dir/version-2/snapshot.0 has invalid magic number 1514885966 != 1514884167

Stack Trace:
java.io.IOException: Transaction log: /home/jenkins/jenkins-slave/workspace/PreCommit-ZOOKEEPER-github-pr-build/build/test/tmp/test8869432496219622507.junit.dir/version-2/snapshot.0 has invalid magic number 1514885966 != 1514884167
	at org.apache.zookeeper.server.persistence.FileTxnLog$FileTxnIterator.inStreamCreated(FileTxnLog.java:626)
	at org.apache.zookeeper.server.persistence.FileTxnLog$FileTxnIterator.createInputArchive(FileTxnLog.java:643)
	at org.apache.zookeeper.server.persistence.FileTxnLog$FileTxnIterator.goToNextLog(FileTxnLog.java:609)
	at org.apache.zookeeper.server.persistence.FileTxnLog$FileTxnIterator.init(FileTxnLog.java:585)
	at org.apache.zookeeper.server.persistence.FileTxnLog$FileTxnIterator.<init>(FileTxnLog.java:547)
	at org.apache.zookeeper.server.persistence.FileTxnLog.read(FileTxnLog.java:369)
	at org.apache.zookeeper.server.persistence.FileTxnLog.read(FileTxnLog.java:356)
	at org.apache.zookeeper.server.persistence.FileTxnSnapLog.restore(FileTxnSnapLog.java:210)
	at org.apache.zookeeper.server.ZKDatabase.loadDataBase(ZKDatabase.java:243)
	at org.apache.zookeeper.server.ZooKeeperServer.loadData(ZooKeeperServer.java:283)
	at org.apache.zookeeper.server.ZooKeeperServer.startdata(ZooKeeperServer.java:447)
	at org.apache.zookeeper.server.NIOServerCnxnFactory.startup(NIOServerCnxnFactory.java:764)
	at org.apache.zookeeper.server.ServerCnxnFactory.startup(ServerCnxnFactory.java:98)
	at org.apache.zookeeper.test.ClientBase.startServerInstance(ClientBase.java:421)
	at org.apache.zookeeper.test.ClientBase.startServer(ClientBase.java:527)
	at org.apache.zookeeper.test.FourLetterWordsWhiteListTest.testISROEnabledWhenReadOnlyModeEnabled(FourLetterWordsWhiteListTest.java:101)
	at org.apache.zookeeper.JUnit4ZKTestRunner$LoggedInvokeMethod.evaluate(JUnit4ZKTestRunner.java:79)
	at java.util.concurrent.FutureTask.run(FutureTask.java:262)
	at java.lang.Thread.run(Thread.java:745)


FAILED:  org.apache.zookeeper.test.FourLetterWordsWhiteListTest.testFourLetterWordsEnableSomeCommands

Error Message:
Transaction log: /home/jenkins/jenkins-slave/workspace/PreCommit-ZOOKEEPER-github-pr-build/build/test/tmp/test4312522338148215797.junit.dir/version-2/snapshot.0 has invalid magic number 1514885966 != 1514884167

Stack Trace:
java.io.IOException: Transaction log: /home/jenkins/jenkins-slave/workspace/PreCommit-ZOOKEEPER-github-pr-build/build/test/tmp/test4312522338148215797.junit.dir/version-2/snapshot.0 has invalid magic number 1514885966 != 1514884167
	at org.apache.zookeeper.server.persistence.FileTxnLog$FileTxnIterator.inStreamCreated(FileTxnLog.java:626)
	at org.apache.zookeeper.server.persistence.FileTxnLog$FileTxnIterator.createInputArchive(FileTxnLog.java:643)
	at org.apache.zookeeper.server.persistence.FileTxnLog$FileTxnIterator.goToNextLog(FileTxnLog.java:609)
	at org.apache.zookeeper.server.persistence.FileTxnLog$FileTxnIterator.init(FileTxnLog.java:585)
	at org.apache.zookeeper.server.persistence.FileTxnLog$FileTxnIterator.<init>(FileTxnLog.java:547)
	at org.apache.zookeeper.server.persistence.FileTxnLog.read(FileTxnLog.java:369)
	at org.apache.zookeeper.server.persistence.FileTxnLog.read(FileTxnLog.java:356)
	at org.apache.zookeeper.server.persistence.FileTxnSnapLog.restore(FileTxnSnapLog.java:210)
	at org.apache.zookeeper.server.ZKDatabase.loadDataBase(ZKDatabase.java:243)
	at org.apache.zookeeper.server.ZooKeeperServer.loadData(ZooKeeperServer.java:283)
	at org.apache.zookeeper.server.ZooKeeperServer.startdata(ZooKeeperServer.java:447)
	at org.apache.zookeeper.server.NIOServerCnxnFactory.startup(NIOServerCnxnFactory.java:764)
	at org.apache.zookeeper.server.ServerCnxnFactory.startup(ServerCnxnFactory.java:98)
	at org.apache.zookeeper.test.ClientBase.startServerInstance(ClientBase.java:421)
	at org.apache.zookeeper.test.ClientBase.startServer(ClientBase.java:527)
	at org.apache.zookeeper.test.FourLetterWordsWhiteListTest.testFourLetterWordsEnableSomeCommands(FourLetterWordsWhiteListTest.java:73)
	at org.apache.zookeeper.JUnit4ZKTestRunner$LoggedInvokeMethod.evaluate(JUnit4ZKTestRunner.java:79)
	at java.util.concurrent.FutureTask.run(FutureTask.java:262)
	at java.lang.Thread.run(Thread.java:745)


FAILED:  org.apache.zookeeper.test.FourLetterWordsWhiteListTest.testFourLetterWordsEnableAllCommandsThroughAsterisk

Error Message:
Transaction log: /home/jenkins/jenkins-slave/workspace/PreCommit-ZOOKEEPER-github-pr-build/build/test/tmp/test3881571642754234279.junit.dir/version-2/snapshot.0 has invalid magic number 1514885966 != 1514884167

Stack Trace:
java.io.IOException: Transaction log: /home/jenkins/jenkins-slave/workspace/PreCommit-ZOOKEEPER-github-pr-build/build/test/tmp/test3881571642754234279.junit.dir/version-2/snapshot.0 has invalid magic number 1514885966 != 1514884167
	at org.apache.zookeeper.server.persistence.FileTxnLog$FileTxnIterator.inStreamCreated(FileTxnLog.java:626)
	at org.apache.zookeeper.server.persistence.FileTxnLog$FileTxnIterator.createInputArchive(FileTxnLog.java:643)
	at org.apache.zookeeper.server.persistence.FileTxnLog$FileTxnIterator.goToNextLog(FileTxnLog.java:609)
	at org.apache.zookeeper.server.persistence.FileTxnLog$FileTxnIterator.init(FileTxnLog.java:585)
	at org.apache.zookeeper.server.persistence.FileTxnLog$FileTxnIterator.<init>(FileTxnLog.java:547)
	at org.apache.zookeeper.server.persistence.FileTxnLog.read(FileTxnLog.java:369)
	at org.apache.zookeeper.server.persistence.FileTxnLog.read(FileTxnLog.java:356)
	at org.apache.zookeeper.server.persistence.FileTxnSnapLog.restore(FileTxnSnapLog.java:210)
	at org.apache.zookeeper.server.ZKDatabase.loadDataBase(ZKDatabase.java:243)
	at org.apache.zookeeper.server.ZooKeeperServer.loadData(ZooKeeperServer.java:283)
	at org.apache.zookeeper.server.ZooKeeperServer.startdata(ZooKeeperServer.java:447)
	at org.apache.zookeeper.server.NIOServerCnxnFactory.startup(NIOServerCnxnFactory.java:764)
	at org.apache.zookeeper.server.ServerCnxnFactory.startup(ServerCnxnFactory.java:98)
	at org.apache.zookeeper.test.ClientBase.startServerInstance(ClientBase.java:421)
	at org.apache.zookeeper.test.ClientBase.startServer(ClientBase.java:527)
	at org.apache.zookeeper.test.FourLetterWordsWhiteListTest.testFourLetterWordsEnableAllCommandsThroughAsterisk(FourLetterWordsWhiteListTest.java:126)
	at org.apache.zookeeper.JUnit4ZKTestRunner$LoggedInvokeMethod.evaluate(JUnit4ZKTestRunner.java:79)
	at java.util.concurrent.FutureTask.run(FutureTask.java:262)
	at java.lang.Thread.run(Thread.java:745)


FAILED:  org.apache.zookeeper.test.FourLetterWordsWhiteListTest.testFourLetterWordsEnableAllCommandsThroughExplicitList

Error Message:
Transaction log: /home/jenkins/jenkins-slave/workspace/PreCommit-ZOOKEEPER-github-pr-build/build/test/tmp/test71563055943536214.junit.dir/version-2/snapshot.0 has invalid magic number 1514885966 != 1514884167

Stack Trace:
java.io.IOException: Transaction log: /home/jenkins/jenkins-slave/workspace/PreCommit-ZOOKEEPER-github-pr-build/build/test/tmp/test71563055943536214.junit.dir/version-2/snapshot.0 has invalid magic number 1514885966 != 1514884167
	at org.apache.zookeeper.server.persistence.FileTxnLog$FileTxnIterator.inStreamCreated(FileTxnLog.java:626)
	at org.apache.zookeeper.server.persistence.FileTxnLog$FileTxnIterator.createInputArchive(FileTxnLog.java:643)
	at org.apache.zookeeper.server.persistence.FileTxnLog$FileTxnIterator.goToNextLog(FileTxnLog.java:609)
	at org.apache.zookeeper.server.persistence.FileTxnLog$FileTxnIterator.init(FileTxnLog.java:585)
	at org.apache.zookeeper.server.persistence.FileTxnLog$FileTxnIterator.<init>(FileTxnLog.java:547)
	at org.apache.zookeeper.server.persistence.FileTxnLog.read(FileTxnLog.java:369)
	at org.apache.zookeeper.server.persistence.FileTxnLog.read(FileTxnLog.java:356)
	at org.apache.zookeeper.server.persistence.FileTxnSnapLog.restore(FileTxnSnapLog.java:210)
	at org.apache.zookeeper.server.ZKDatabase.loadDataBase(ZKDatabase.java:243)
	at org.apache.zookeeper.server.ZooKeeperServer.loadData(ZooKeeperServer.java:283)
	at org.apache.zookeeper.server.ZooKeeperServer.startdata(ZooKeeperServer.java:447)
	at org.apache.zookeeper.server.NIOServerCnxnFactory.startup(NIOServerCnxnFactory.java:764)
	at org.apache.zookeeper.server.ServerCnxnFactory.startup(ServerCnxnFactory.java:98)
	at org.apache.zookeeper.test.ClientBase.startServerInstance(ClientBase.java:421)
	at org.apache.zookeeper.test.ClientBase.startServer(ClientBase.java:527)
	at org.apache.zookeeper.test.FourLetterWordsWhiteListTest.testFourLetterWordsEnableAllCommandsThroughExplicitList(FourLetterWordsWhiteListTest.java:138)
	at org.apache.zookeeper.JUnit4ZKTestRunner$LoggedInvokeMethod.evaluate(JUnit4ZKTestRunner.java:79)
	at java.util.concurrent.FutureTask.run(FutureTask.java:262)
	at java.lang.Thread.run(Thread.java:745)


FAILED:  org.apache.zookeeper.test.FourLetterWordsWhiteListTest.testFourLetterWordsAllDisabledByDefault

Error Message:
Transaction log: /home/jenkins/jenkins-slave/workspace/PreCommit-ZOOKEEPER-github-pr-build/build/test/tmp/test864843967223558433.junit.dir/version-2/snapshot.0 has invalid magic number 1514885966 != 1514884167

Stack Trace:
java.io.IOException: Transaction log: /home/jenkins/jenkins-slave/workspace/PreCommit-ZOOKEEPER-github-pr-build/build/test/tmp/test864843967223558433.junit.dir/version-2/snapshot.0 has invalid magic number 1514885966 != 1514884167
	at org.apache.zookeeper.server.persistence.FileTxnLog$FileTxnIterator.inStreamCreated(FileTxnLog.java:626)
	at org.apache.zookeeper.server.persistence.FileTxnLog$FileTxnIterator.createInputArchive(FileTxnLog.java:643)
	at org.apache.zookeeper.server.persistence.FileTxnLog$FileTxnIterator.goToNextLog(FileTxnLog.java:609)
	at org.apache.zookeeper.server.persistence.FileTxnLog$FileTxnIterator.init(FileTxnLog.java:585)
	at org.apache.zookeeper.server.persistence.FileTxnLog$FileTxnIterator.<init>(FileTxnLog.java:547)
	at org.apache.zookeeper.server.persistence.FileTxnLog.read(FileTxnLog.java:369)
	at org.apache.zookeeper.server.persistence.FileTxnLog.read(FileTxnLog.java:356)
	at org.apache.zookeeper.server.persistence.FileTxnSnapLog.restore(FileTxnSnapLog.java:210)
	at org.apache.zookeeper.server.ZKDatabase.loadDataBase(ZKDatabase.java:243)
	at org.apache.zookeeper.server.ZooKeeperServer.loadData(ZooKeeperServer.java:283)
	at org.apache.zookeeper.server.ZooKeeperServer.startdata(ZooKeeperServer.java:447)
	at org.apache.zookeeper.server.NIOServerCnxnFactory.startup(NIOServerCnxnFactory.java:764)
	at org.apache.zookeeper.server.ServerCnxnFactory.startup(ServerCnxnFactory.java:98)
	at org.apache.zookeeper.test.ClientBase.startServerInstance(ClientBase.java:421)
	at org.apache.zookeeper.test.ClientBase.startServer(ClientBase.java:527)
	at org.apache.zookeeper.test.FourLetterWordsWhiteListTest.testFourLetterWordsAllDisabledByDefault(FourLetterWordsWhiteListTest.java:49)
	at org.apache.zookeeper.JUnit4ZKTestRunner$LoggedInvokeMethod.evaluate(JUnit4ZKTestRunner.java:79)
	at java.util.concurrent.FutureTask.run(FutureTask.java:262)
	at java.lang.Thread.run(Thread.java:745)


FAILED:  org.apache.zookeeper.test.FourLetterWordsWhiteListTest.testFourLetterWordsInvalidConfiguration

Error Message:
Transaction log: /home/jenkins/jenkins-slave/workspace/PreCommit-ZOOKEEPER-github-pr-build/build/test/tmp/test5673349845811696119.junit.dir/version-2/snapshot.0 has invalid magic number 1514885966 != 1514884167

Stack Trace:
java.io.IOException: Transaction log: /home/jenkins/jenkins-slave/workspace/PreCommit-ZOOKEEPER-github-pr-build/build/test/tmp/test5673349845811696119.junit.dir/version-2/snapshot.0 has invalid magic number 1514885966 != 1514884167
	at org.apache.zookeeper.server.persistence.FileTxnLog$FileTxnIterator.inStreamCreated(FileTxnLog.java:626)
	at org.apache.zookeeper.server.persistence.FileTxnLog$FileTxnIterator.createInputArchive(FileTxnLog.java:643)
	at org.apache.zookeeper.server.persistence.FileTxnLog$FileTxnIterator.goToNextLog(FileTxnLog.java:609)
	at org.apache.zookeeper.server.persistence.FileTxnLog$FileTxnIterator.init(FileTxnLog.java:585)
	at org.apache.zookeeper.server.persistence.FileTxnLog$FileTxnIterator.<init>(FileTxnLog.java:547)
	at org.apache.zookeeper.server.persistence.FileTxnLog.read(FileTxnLog.java:369)
	at org.apache.zookeeper.server.persistence.FileTxnLog.read(FileTxnLog.java:356)
	at org.apache.zookeeper.server.persistence.FileTxnSnapLog.restore(FileTxnSnapLog.java:210)
	at org.apache.zookeeper.server.ZKDatabase.loadDataBase(ZKDatabase.java:243)
	at org.apache.zookeeper.server.ZooKeeperServer.loadData(ZooKeeperServer.java:283)
	at org.apache.zookeeper.server.ZooKeeperServer.startdata(ZooKeeperServer.java:447)
	at org.apache.zookeeper.server.NIOServerCnxnFactory.startup(NIOServerCnxnFactory.java:764)
	at org.apache.zookeeper.server.ServerCnxnFactory.startup(ServerCnxnFactory.java:98)
	at org.apache.zookeeper.test.ClientBase.startServerInstance(ClientBase.java:421)
	at org.apache.zookeeper.test.ClientBase.startServer(ClientBase.java:527)
	at org.apache.zookeeper.test.FourLetterWordsWhiteListTest.testFourLetterWordsInvalidConfiguration(FourLetterWordsWhiteListTest.java:113)
	at org.apache.zookeeper.JUnit4ZKTestRunner$LoggedInvokeMethod.evaluate(JUnit4ZKTestRunner.java:79)
	at java.util.concurrent.FutureTask.run(FutureTask.java:262)
	at java.lang.Thread.run(Thread.java:745)


FAILED:  org.apache.zookeeper.test.LoadFromLogTest.testLoad

Error Message:
Transaction log: /home/jenkins/jenkins-slave/workspace/PreCommit-ZOOKEEPER-github-pr-build/build/test/tmp/test4546155107890531950.junit.dir/version-2/snapshot.0 has invalid magic number 1514885966 != 1514884167

Stack Trace:
java.io.IOException: Transaction log: /home/jenkins/jenkins-slave/workspace/PreCommit-ZOOKEEPER-github-pr-build/build/test/tmp/test4546155107890531950.junit.dir/version-2/snapshot.0 has invalid magic number 1514885966 != 1514884167
	at org.apache.zookeeper.server.persistence.FileTxnLog$FileTxnIterator.inStreamCreated(FileTxnLog.java:626)
	at org.apache.zookeeper.server.persistence.FileTxnLog$FileTxnIterator.createInputArchive(FileTxnLog.java:643)
	at org.apache.zookeeper.server.persistence.FileTxnLog$FileTxnIterator.goToNextLog(FileTxnLog.java:609)
	at org.apache.zookeeper.server.persistence.FileTxnLog$FileTxnIterator.init(FileTxnLog.java:585)
	at org.apache.zookeeper.server.persistence.FileTxnLog$FileTxnIterator.<init>(FileTxnLog.java:547)
	at org.apache.zookeeper.server.persistence.FileTxnLog.read(FileTxnLog.java:369)
	at org.apache.zookeeper.server.persistence.FileTxnLog.read(FileTxnLog.java:356)
	at org.apache.zookeeper.test.LoadFromLogTest.testLoad(LoadFromLogTest.java:108)
	at org.apache.zookeeper.JUnit4ZKTestRunner$LoggedInvokeMethod.evaluate(JUnit4ZKTestRunner.java:79)


FAILED:  org.apache.zookeeper.test.LoadFromLogTest.testLoadFailure

Error Message:
Transaction log: /home/jenkins/jenkins-slave/workspace/PreCommit-ZOOKEEPER-github-pr-build/build/test/tmp/test1764688505087837630.junit.dir/version-2/snapshot.46 has invalid magic number 1514885966 != 1514884167

Stack Trace:
java.io.IOException: Transaction log: /home/jenkins/jenkins-slave/workspace/PreCommit-ZOOKEEPER-github-pr-build/build/test/tmp/test1764688505087837630.junit.dir/version-2/snapshot.46 has invalid magic number 1514885966 != 1514884167
	at org.apache.zookeeper.server.persistence.FileTxnLog$FileTxnIterator.inStreamCreated(FileTxnLog.java:626)
	at org.apache.zookeeper.server.persistence.FileTxnLog$FileTxnIterator.createInputArchive(FileTxnLog.java:643)
	at org.apache.zookeeper.server.persistence.FileTxnLog$FileTxnIterator.goToNextLog(FileTxnLog.java:609)
	at org.apache.zookeeper.server.persistence.FileTxnLog$FileTxnIterator.init(FileTxnLog.java:585)
	at org.apache.zookeeper.server.persistence.FileTxnLog$FileTxnIterator.<init>(FileTxnLog.java:547)
	at org.apache.zookeeper.server.persistence.FileTxnLog.read(FileTxnLog.java:369)
	at org.apache.zookeeper.test.LoadFromLogTest.testLoadFailure(LoadFromLogTest.java:177)
	at org.apache.zookeeper.JUnit4ZKTestRunner$LoggedInvokeMethod.evaluate(JUnit4ZKTestRunner.java:79)


FAILED:  org.apache.zookeeper.test.AsyncHammerTest.testHammer

Error Message:
Unable to run quorum server 

Stack Trace:
java.lang.RuntimeException: Unable to run quorum server 
	at org.apache.zookeeper.server.quorum.QuorumPeer.loadDataBase(QuorumPeer.java:822)
	at org.apache.zookeeper.server.quorum.QuorumPeer.start(QuorumPeer.java:771)
	at org.apache.zookeeper.test.QuorumBase.startServers(QuorumBase.java:211)
	at org.apache.zookeeper.test.QuorumBase.startServers(QuorumBase.java:133)
	at org.apache.zookeeper.test.AsyncHammerTest.restart(AsyncHammerTest.java:61)
	at org.apache.zookeeper.test.AsyncHammerTest.testHammer(AsyncHammerTest.java:192)
	at org.apache.zookeeper.JUnit4ZKTestRunner$LoggedInvokeMethod.evaluate(JUnit4ZKTestRunner.java:79)
Caused by: java.io.EOFException
	at java.io.DataInputStream.readInt(DataInputStream.java:392)
	at org.apache.jute.BinaryInputArchive.readInt(BinaryInputArchive.java:63)
	at org.apache.zookeeper.server.persistence.FileHeader.deserialize(FileHeader.java:66)
	at org.apache.zookeeper.server.persistence.FileTxnLog$FileTxnIterator.inStreamCreated(FileTxnLog.java:624)
	at org.apache.zookeeper.server.persistence.FileTxnLog$FileTxnIterator.createInputArchive(FileTxnLog.java:643)
	at org.apache.zookeeper.server.persistence.FileTxnLog$FileTxnIterator.goToNextLog(FileTxnLog.java:609)
	at org.apache.zookeeper.server.persistence.FileTxnLog$FileTxnIterator.init(FileTxnLog.java:585)
	at org.apache.zookeeper.server.persistence.FileTxnLog$FileTxnIterator.<init>(FileTxnLog.java:547)
	at org.apache.zookeeper.server.persistence.FileTxnLog.read(FileTxnLog.java:369)
	at org.apache.zookeeper.server.persistence.FileTxnLog.read(FileTxnLog.java:356)
	at org.apache.zookeeper.server.persistence.FileTxnSnapLog.restore(FileTxnSnapLog.java:210)
	at org.apache.zookeeper.server.ZKDatabase.loadDataBase(ZKDatabase.java:243)
	at org.apache.zookeeper.server.quorum.QuorumPeer.loadDataBase(QuorumPeer.java:785)


FAILED:  org.apache.zookeeper.test.AsyncHammerTest.testHammer

Error Message:
Unable to run quorum server 

Stack Trace:
java.lang.RuntimeException: Unable to run quorum server 
	at org.apache.zookeeper.server.quorum.QuorumPeer.loadDataBase(QuorumPeer.java:822)
	at org.apache.zookeeper.server.quorum.QuorumPeer.start(QuorumPeer.java:771)
	at org.apache.zookeeper.test.QuorumBase.startServers(QuorumBase.java:211)
	at org.apache.zookeeper.test.QuorumBase.startServers(QuorumBase.java:133)
	at org.apache.zookeeper.test.AsyncHammerTest.restart(AsyncHammerTest.java:61)
	at org.apache.zookeeper.test.AsyncHammerTest.testHammer(AsyncHammerTest.java:192)
	at org.apache.zookeeper.JUnit4ZKTestRunner$LoggedInvokeMethod.evaluate(JUnit4ZKTestRunner.java:79)
Caused by: java.io.EOFException
	at java.io.DataInputStream.readInt(DataInputStream.java:392)
	at org.apache.jute.BinaryInputArchive.readInt(BinaryInputArchive.java:63)
	at org.apache.zookeeper.server.persistence.FileHeader.deserialize(FileHeader.java:66)
	at org.apache.zookeeper.server.persistence.FileTxnLog$FileTxnIterator.inStreamCreated(FileTxnLog.java:624)
	at org.apache.zookeeper.server.persistence.FileTxnLog$FileTxnIterator.createInputArchive(FileTxnLog.java:643)
	at org.apache.zookeeper.server.persistence.FileTxnLog$FileTxnIterator.goToNextLog(FileTxnLog.java:609)
	at org.apache.zookeeper.server.persistence.FileTxnLog$FileTxnIterator.init(FileTxnLog.java:585)
	at org.apache.zookeeper.server.persistence.FileTxnLog$FileTxnIterator.<init>(FileTxnLog.java:547)
	at org.apache.zookeeper.server.persistence.FileTxnLog.read(FileTxnLog.java:369)
	at org.apache.zookeeper.server.persistence.FileTxnLog.read(FileTxnLog.java:356)
	at org.apache.zookeeper.server.persistence.FileTxnSnapLog.restore(FileTxnSnapLog.java:210)
	at org.apache.zookeeper.server.ZKDatabase.loadDataBase(ZKDatabase.java:243)
	at org.apache.zookeeper.server.quorum.QuorumPeer.loadDataBase(QuorumPeer.java:785)


FAILED:  org.apache.zookeeper.test.QuorumUtilTest.validateAllMXBeanAreUnregistered

Error Message:
Unable to run quorum server 

Stack Trace:
java.lang.RuntimeException: Unable to run quorum server 
	at org.apache.zookeeper.server.quorum.QuorumPeer.loadDataBase(QuorumPeer.java:822)
	at org.apache.zookeeper.server.quorum.QuorumPeer.start(QuorumPeer.java:771)
	at org.apache.zookeeper.test.QuorumUtil.start(QuorumUtil.java:211)
	at org.apache.zookeeper.test.QuorumUtil.restart(QuorumUtil.java:215)
	at org.apache.zookeeper.test.QuorumUtilTest.validateAllMXBeanAreUnregistered(QuorumUtilTest.java:84)
	at org.apache.zookeeper.JUnit4ZKTestRunner$LoggedInvokeMethod.evaluate(JUnit4ZKTestRunner.java:79)
Caused by: java.io.EOFException
	at java.io.DataInputStream.readInt(DataInputStream.java:392)
	at org.apache.jute.BinaryInputArchive.readInt(BinaryInputArchive.java:63)
	at org.apache.zookeeper.server.persistence.FileHeader.deserialize(FileHeader.java:66)
	at org.apache.zookeeper.server.persistence.FileTxnLog$FileTxnIterator.inStreamCreated(FileTxnLog.java:624)
	at org.apache.zookeeper.server.persistence.FileTxnLog$FileTxnIterator.createInputArchive(FileTxnLog.java:643)
	at org.apache.zookeeper.server.persistence.FileTxnLog$FileTxnIterator.goToNextLog(FileTxnLog.java:609)
	at org.apache.zookeeper.server.persistence.FileTxnLog$FileTxnIterator.init(FileTxnLog.java:585)
	at org.apache.zookeeper.server.persistence.FileTxnLog$FileTxnIterator.<init>(FileTxnLog.java:547)
	at org.apache.zookeeper.server.persistence.FileTxnLog.read(FileTxnLog.java:369)
	at org.apache.zookeeper.server.persistence.FileTxnLog.read(FileTxnLog.java:356)
	at org.apache.zookeeper.server.persistence.FileTxnSnapLog.restore(FileTxnSnapLog.java:210)
	at org.apache.zookeeper.server.ZKDatabase.loadDataBase(ZKDatabase.java:243)
	at org.apache.zookeeper.server.quorum.QuorumPeer.loadDataBase(QuorumPeer.java:785)


FAILED:  org.apache.zookeeper.test.QuorumZxidSyncTest.testBehindLeader

Error Message:
Unable to run quorum server 

Stack Trace:
java.lang.RuntimeException: Unable to run quorum server 
	at org.apache.zookeeper.server.quorum.QuorumPeer.loadDataBase(QuorumPeer.java:822)
	at org.apache.zookeeper.server.quorum.QuorumPeer.start(QuorumPeer.java:771)
	at org.apache.zookeeper.test.QuorumBase.startServers(QuorumBase.java:211)
	at org.apache.zookeeper.test.QuorumBase.startServers(QuorumBase.java:133)
	at org.apache.zookeeper.test.QuorumZxidSyncTest.testBehindLeader(QuorumZxidSyncTest.java:57)
	at org.apache.zookeeper.JUnit4ZKTestRunner$LoggedInvokeMethod.evaluate(JUnit4ZKTestRunner.java:79)
Caused by: java.io.EOFException
	at java.io.DataInputStream.readInt(DataInputStream.java:392)
	at org.apache.jute.BinaryInputArchive.readInt(BinaryInputArchive.java:63)
	at org.apache.zookeeper.server.persistence.FileHeader.deserialize(FileHeader.java:66)
	at org.apache.zookeeper.server.persistence.FileTxnLog$FileTxnIterator.inStreamCreated(FileTxnLog.java:624)
	at org.apache.zookeeper.server.persistence.FileTxnLog$FileTxnIterator.createInputArchive(FileTxnLog.java:643)
	at org.apache.zookeeper.server.persistence.FileTxnLog$FileTxnIterator.goToNextLog(FileTxnLog.java:609)
	at org.apache.zookeeper.server.persistence.FileTxnLog$FileTxnIterator.init(FileTxnLog.java:585)
	at org.apache.zookeeper.server.persistence.FileTxnLog$FileTxnIterator.<init>(FileTxnLog.java:547)
	at org.apache.zookeeper.server.persistence.FileTxnLog.read(FileTxnLog.java:369)
	at org.apache.zookeeper.server.persistence.FileTxnLog.read(FileTxnLog.java:356)
	at org.apache.zookeeper.server.persistence.FileTxnSnapLog.restore(FileTxnSnapLog.java:210)
	at org.apache.zookeeper.server.ZKDatabase.loadDataBase(ZKDatabase.java:243)
	at org.apache.zookeeper.server.quorum.QuorumPeer.loadDataBase(QuorumPeer.java:785)


FAILED:  org.apache.zookeeper.test.QuorumZxidSyncTest.testLateLogs

Error Message:
Unable to run quorum server 

Stack Trace:
java.lang.RuntimeException: Unable to run quorum server 
	at org.apache.zookeeper.server.quorum.QuorumPeer.loadDataBase(QuorumPeer.java:822)
	at org.apache.zookeeper.server.quorum.QuorumPeer.start(QuorumPeer.java:771)
	at org.apache.zookeeper.test.QuorumBase.startServers(QuorumBase.java:211)
	at org.apache.zookeeper.test.QuorumBase.startServers(QuorumBase.java:133)
	at org.apache.zookeeper.test.QuorumZxidSyncTest.testLateLogs(QuorumZxidSyncTest.java:118)
	at org.apache.zookeeper.JUnit4ZKTestRunner$LoggedInvokeMethod.evaluate(JUnit4ZKTestRunner.java:79)
Caused by: java.io.EOFException
	at java.io.DataInputStream.readInt(DataInputStream.java:392)
	at org.apache.jute.BinaryInputArchive.readInt(BinaryInputArchive.java:63)
	at org.apache.zookeeper.server.persistence.FileHeader.deserialize(FileHeader.java:66)
	at org.apache.zookeeper.server.persistence.FileTxnLog$FileTxnIterator.inStreamCreated(FileTxnLog.java:624)
	at org.apache.zookeeper.server.persistence.FileTxnLog$FileTxnIterator.createInputArchive(FileTxnLog.java:643)
	at org.apache.zookeeper.server.persistence.FileTxnLog$FileTxnIterator.goToNextLog(FileTxnLog.java:609)
	at org.apache.zookeeper.server.persistence.FileTxnLog$FileTxnIterator.init(FileTxnLog.java:585)
	at org.apache.zookeeper.server.persistence.FileTxnLog$FileTxnIterator.<init>(FileTxnLog.java:547)
	at org.apache.zookeeper.server.persistence.FileTxnLog.read(FileTxnLog.java:369)
	at org.apache.zookeeper.server.persistence.FileTxnLog.read(FileTxnLog.java:356)
	at org.apache.zookeeper.server.persistence.FileTxnSnapLog.restore(FileTxnSnapLog.java:210)
	at org.apache.zookeeper.server.ZKDatabase.loadDataBase(ZKDatabase.java:243)
	at org.apache.zookeeper.server.quorum.QuorumPeer.loadDataBase(QuorumPeer.java:785)


FAILED:  org.apache.zookeeper.server.CRCTest.testChecksums

Error Message:
Transaction log: /home/jenkins/jenkins-slave/workspace/PreCommit-ZOOKEEPER-github-pr-build/build/test/tmp/test4990623106283181881.junit.dir/version-2/snapshot.0 has invalid magic number 1514885966 != 1514884167

Stack Trace:
java.io.IOException: Transaction log: /home/jenkins/jenkins-slave/workspace/PreCommit-ZOOKEEPER-github-pr-build/build/test/tmp/test4990623106283181881.junit.dir/version-2/snapshot.0 has invalid magic number 1514885966 != 1514884167
	at org.apache.zookeeper.server.persistence.FileTxnLog$FileTxnIterator.inStreamCreated(FileTxnLog.java:626)
	at org.apache.zookeeper.server.persistence.FileTxnLog$FileTxnIterator.createInputArchive(FileTxnLog.java:643)
	at org.apache.zookeeper.server.persistence.FileTxnLog$FileTxnIterator.goToNextLog(FileTxnLog.java:609)
	at org.apache.zookeeper.server.persistence.FileTxnLog$FileTxnIterator.init(FileTxnLog.java:585)
	at org.apache.zookeeper.server.persistence.FileTxnLog$FileTxnIterator.<init>(FileTxnLog.java:547)
	at org.apache.zookeeper.server.persistence.FileTxnLog.read(FileTxnLog.java:369)
	at org.apache.zookeeper.server.persistence.FileTxnLog.read(FileTxnLog.java:356)
	at org.apache.zookeeper.server.CRCTest.testChecksums(CRCTest.java:147)
	at org.apache.zookeeper.JUnit4ZKTestRunner$LoggedInvokeMethod.evaluate(JUnit4ZKTestRunner.java:79)
Mime
  • Unnamed multipart/mixed (inline, None, 0 bytes)
View raw message