zookeeper-dev mailing list archives

Site index · List index
Message view « Date » · « Thread »
Top « Date » · « Thread »
From Apache Jenkins Server <jenk...@builds.apache.org>
Subject ZooKeeper-trunk - Build # 3615 - Still Failing
Date Sun, 19 Nov 2017 23:31:36 GMT
See https://builds.apache.org/job/ZooKeeper-trunk/3615/

###################################################################################
########################## LAST 60 LINES OF THE CONSOLE ###########################
[...truncated 65.20 MB...]
     [exec] Log Message Received: [2017-11-19 23:29:32,522:1605(0x2b139d98d540):ZOO_INFO@zookeeper_init_internal@1152:
Initiating client connection, host=127.0.0.1:22181 sessionTimeout=10000 watcher=0x461d20 sessionId=0
sessionPasswd=<null> context=0x7ffe8a941dd0 flags=0]
     [exec] Log Message Received: [2017-11-19 23:29:32,523:1605(0x2b139f9ee700):ZOO_INFO@check_events@2425:
initiated connection to server [127.0.0.1:22181]]
     [exec] Log Message Received: [2017-11-19 23:29:32,526:1605(0x2b139f9ee700):ZOO_INFO@check_events@2477:
session establishment complete on server [127.0.0.1:22181], sessionId=0x1002e59b71c000f, negotiated
timeout=10000 ]
     [exec]  : elapsed 1000 : OK
     [exec] Zookeeper_simpleSystem::testAsyncWatcherAutoReset ZooKeeper server started : elapsed
10180 : OK
     [exec] Zookeeper_simpleSystem::testDeserializeString : elapsed 0 : OK
     [exec] Zookeeper_simpleSystem::testFirstServerDown : elapsed 1001 : OK
     [exec] Zookeeper_simpleSystem::testNullData : elapsed 1026 : OK
     [exec] Zookeeper_simpleSystem::testIPV6 : elapsed 1003 : OK
     [exec] Zookeeper_simpleSystem::testCreate : elapsed 1007 : OK
     [exec] Zookeeper_simpleSystem::testPath : elapsed 1013 : OK
     [exec] Zookeeper_simpleSystem::testPathValidation : elapsed 1039 : OK
     [exec] Zookeeper_simpleSystem::testPing : elapsed 17177 : OK
     [exec] Zookeeper_simpleSystem::testAcl : elapsed 1012 : OK
     [exec] Zookeeper_simpleSystem::testChroot : elapsed 3028 : OK
     [exec] Zookeeper_simpleSystem::testAuth ZooKeeper server started ZooKeeper server started
: elapsed 30391 : OK
     [exec] Zookeeper_simpleSystem::testHangingClient : elapsed 1020 : OK
     [exec] Zookeeper_simpleSystem::testWatcherAutoResetWithGlobal ZooKeeper server started
ZooKeeper server started ZooKeeper server started : elapsed 14630 : OK
     [exec] Zookeeper_simpleSystem::testWatcherAutoResetWithLocal ZooKeeper server started
ZooKeeper server started ZooKeeper server started : elapsed 14637 : OK
     [exec] Zookeeper_simpleSystem::testGetChildren2 : elapsed 1034 : OK
     [exec] Zookeeper_simpleSystem::testLastZxid : elapsed 4512 : OK
     [exec] Zookeeper_simpleSystem::testRemoveWatchers ZooKeeper server started : elapsed
4245 : OK
     [exec] rm: cannot remove '/tmp/zkdata/myid': Permission denied
     [exec] Zookeeper_readOnly::testReadOnly : assertion : elapsed 4047
     [exec] /home/jenkins/jenkins-slave/workspace/ZooKeeper-trunk/src/c/tests/TestReadOnlyClient.cc:99:
Assertion: equality assertion failed [Expected: 0, Actual  : -4]
     [exec] Failures !!!
     [exec] Run: 74   Failure total: 1   Failures: 1   Errors: 0
     [exec] FAIL: zktest-mt
     [exec] ==========================================
     [exec] 1 of 2 tests failed
     [exec] Please report to user@zookeeper.apache.org
     [exec] ==========================================
     [exec] make[1]: Leaving directory `/home/jenkins/jenkins-slave/workspace/ZooKeeper-trunk/build/test/test-cppunit'
     [exec] /home/jenkins/jenkins-slave/workspace/ZooKeeper-trunk/src/c/tests/zkServer.sh:
line 62: kill: (13719) - No such process
     [exec] make[1]: *** [check-TESTS] Error 1
     [exec] make: *** [check-am] Error 2

BUILD FAILED
/home/jenkins/jenkins-slave/workspace/ZooKeeper-trunk/build.xml:1386: The following error
occurred while executing this line:
/home/jenkins/jenkins-slave/workspace/ZooKeeper-trunk/build.xml:1346: The following error
occurred while executing this line:
/home/jenkins/jenkins-slave/workspace/ZooKeeper-trunk/build.xml:1356: exec returned: 2

Total time: 14 minutes 56 seconds
Build step 'Execute shell' marked build as failure
[FINDBUGS] Skipping publisher since build result is FAILURE
[WARNINGS] Skipping publisher since build result is FAILURE
Archiving artifacts
Setting JDK_1_7_LATEST__HOME=/home/jenkins/tools/java/latest1.7
Recording fingerprints
Setting JDK_1_7_LATEST__HOME=/home/jenkins/tools/java/latest1.7
Recording test results
Setting JDK_1_7_LATEST__HOME=/home/jenkins/tools/java/latest1.7
Publishing Javadoc
Setting JDK_1_7_LATEST__HOME=/home/jenkins/tools/java/latest1.7
Setting JDK_1_7_LATEST__HOME=/home/jenkins/tools/java/latest1.7
Email was triggered for: Failure - Any
Sending email for trigger: Failure - Any
Setting JDK_1_7_LATEST__HOME=/home/jenkins/tools/java/latest1.7
Setting JDK_1_7_LATEST__HOME=/home/jenkins/tools/java/latest1.7



###################################################################################
############################## FAILED TESTS (if any) ##############################
All tests passed
Mime
  • Unnamed multipart/mixed (inline, None, 0 bytes)
View raw message