zookeeper-dev mailing list archives

Site index · List index
Message view « Date » · « Thread »
Top « Date » · « Thread »
From Apache Jenkins Server <jenk...@builds.apache.org>
Subject ZooKeeper-trunk - Build # 3633 - Still Failing
Date Mon, 27 Nov 2017 23:42:17 GMT
See https://builds.apache.org/job/ZooKeeper-trunk/3633/

###################################################################################
########################## LAST 60 LINES OF THE CONSOLE ###########################
[...truncated 66.82 MB...]
    [junit] 	at org.apache.zookeeper.ClientCnxnSocketNIO.doTransport(ClientCnxnSocketNIO.java:357)
    [junit] 	at org.apache.zookeeper.ClientCnxn$SendThread.run(ClientCnxn.java:1214)
    [junit] 2017-11-27 23:42:08,078 [myid:] - INFO  [ProcessThread(sid:0 cport:22240)::PrepRequestProcessor@614]
- Processed session termination for sessionid: 0x108298c32f80000
    [junit] 2017-11-27 23:42:08,079 [myid:] - INFO  [SyncThread:0:MBeanRegistry@128] - Unregister
MBean [org.apache.ZooKeeperService:name0=StandaloneServer_port22240,name1=Connections,name2=127.0.0.1,name3=0x108298c32f80000]
    [junit] 2017-11-27 23:42:08,079 [myid:] - INFO  [main:ZooKeeper@1332] - Session: 0x108298c32f80000
closed
    [junit] 2017-11-27 23:42:08,080 [myid:] - INFO  [main-EventThread:ClientCnxn$EventThread@513]
- EventThread shut down for session: 0x108298c32f80000
    [junit] 2017-11-27 23:42:08,080 [myid:] - INFO  [main:JUnit4ZKTestRunner$LoggedInvokeMethod@82]
- Memory used 222319
    [junit] 2017-11-27 23:42:08,080 [myid:] - INFO  [main:JUnit4ZKTestRunner$LoggedInvokeMethod@87]
- Number of threads 2431
    [junit] 2017-11-27 23:42:08,080 [myid:] - INFO  [main:JUnit4ZKTestRunner$LoggedInvokeMethod@102]
- FINISHED TEST METHOD testWatcherAutoResetWithLocal
    [junit] 2017-11-27 23:42:08,080 [myid:] - INFO  [main:ClientBase@601] - tearDown starting
    [junit] 2017-11-27 23:42:08,081 [myid:] - INFO  [main:ClientBase@571] - STOPPING server
    [junit] 2017-11-27 23:42:08,081 [myid:] - INFO  [main:NettyServerCnxnFactory@464] - shutdown
called 0.0.0.0/0.0.0.0:22240
    [junit] 2017-11-27 23:42:08,089 [myid:] - INFO  [main:ZooKeeperServer@546] - shutting
down
    [junit] 2017-11-27 23:42:08,089 [myid:] - INFO  [main:SessionTrackerImpl@232] - Shutting
down
    [junit] 2017-11-27 23:42:08,090 [myid:] - INFO  [main:PrepRequestProcessor@1010] - Shutting
down
    [junit] 2017-11-27 23:42:08,090 [myid:] - INFO  [main:SyncRequestProcessor@191] - Shutting
down
    [junit] 2017-11-27 23:42:08,090 [myid:] - INFO  [ProcessThread(sid:0 cport:22240)::PrepRequestProcessor@155]
- PrepRequestProcessor exited loop!
    [junit] 2017-11-27 23:42:08,090 [myid:] - INFO  [SyncThread:0:SyncRequestProcessor@169]
- SyncRequestProcessor exited!
    [junit] 2017-11-27 23:42:08,090 [myid:] - INFO  [main:FinalRequestProcessor@481] - shutdown
of request processor complete
    [junit] 2017-11-27 23:42:08,091 [myid:] - INFO  [main:MBeanRegistry@128] - Unregister
MBean [org.apache.ZooKeeperService:name0=StandaloneServer_port22240,name1=InMemoryDataTree]
    [junit] 2017-11-27 23:42:08,091 [myid:] - INFO  [main:MBeanRegistry@128] - Unregister
MBean [org.apache.ZooKeeperService:name0=StandaloneServer_port22240]
    [junit] 2017-11-27 23:42:08,091 [myid:] - INFO  [main:FourLetterWordMain@87] - connecting
to 127.0.0.1 22240
    [junit] 2017-11-27 23:42:08,092 [myid:] - INFO  [main:JMXEnv@146] - ensureOnly:[]
    [junit] 2017-11-27 23:42:08,103 [myid:] - INFO  [main:ClientBase@626] - fdcount after
test is: 7162 at start it was 7162
    [junit] 2017-11-27 23:42:08,104 [myid:] - INFO  [main:ZKTestCase$1@68] - SUCCEEDED testWatcherAutoResetWithLocal
    [junit] 2017-11-27 23:42:08,104 [myid:] - INFO  [main:ZKTestCase$1@63] - FINISHED testWatcherAutoResetWithLocal
    [junit] 2017-11-27 23:42:08,115 [myid:127.0.0.1:22120] - INFO  [main-SendThread(127.0.0.1:22120):ClientCnxn$SendThread@1113]
- Opening socket connection to server 127.0.0.1/127.0.0.1:22120. Will not attempt to authenticate
using SASL (unknown error)
    [junit] 2017-11-27 23:42:08,116 [myid:127.0.0.1:22120] - WARN  [main-SendThread(127.0.0.1:22120):ClientCnxn$SendThread@1235]
- Session 0x2082988c2cc0000 for server 127.0.0.1/127.0.0.1:22120, unexpected error, closing
socket connection and attempting reconnect
    [junit] java.net.ConnectException: Connection refused
    [junit] 	at sun.nio.ch.SocketChannelImpl.checkConnect(Native Method)
    [junit] 	at sun.nio.ch.SocketChannelImpl.finishConnect(SocketChannelImpl.java:744)
    [junit] 	at org.apache.zookeeper.ClientCnxnSocketNIO.doTransport(ClientCnxnSocketNIO.java:357)
    [junit] 	at org.apache.zookeeper.ClientCnxn$SendThread.run(ClientCnxn.java:1214)
    [junit] Tests run: 105, Failures: 0, Errors: 0, Skipped: 0, Time elapsed: 420.834 sec,
Thread: 5, Class: org.apache.zookeeper.test.NioNettySuiteTest

fail.build.on.test.failure:

BUILD FAILED
/home/jenkins/jenkins-slave/workspace/ZooKeeper-trunk/build.xml:1395: The following error
occurred while executing this line:
/home/jenkins/jenkins-slave/workspace/ZooKeeper-trunk/build.xml:1276: The following error
occurred while executing this line:
/home/jenkins/jenkins-slave/workspace/ZooKeeper-trunk/build.xml:1280: Tests failed!

Total time: 10 minutes 20 seconds
Build step 'Execute shell' marked build as failure
[FINDBUGS] Skipping publisher since build result is FAILURE
[WARNINGS] Skipping publisher since build result is FAILURE
Archiving artifacts
Setting JDK_1_7_LATEST__HOME=/home/jenkins/tools/java/latest1.7
Recording fingerprints
Setting JDK_1_7_LATEST__HOME=/home/jenkins/tools/java/latest1.7
Recording test results
Setting JDK_1_7_LATEST__HOME=/home/jenkins/tools/java/latest1.7
Publishing Javadoc
Setting JDK_1_7_LATEST__HOME=/home/jenkins/tools/java/latest1.7
Setting JDK_1_7_LATEST__HOME=/home/jenkins/tools/java/latest1.7
Email was triggered for: Failure - Any
Sending email for trigger: Failure - Any
Setting JDK_1_7_LATEST__HOME=/home/jenkins/tools/java/latest1.7
Setting JDK_1_7_LATEST__HOME=/home/jenkins/tools/java/latest1.7



###################################################################################
############################## FAILED TESTS (if any) ##############################
1 tests failed.
FAILED:  org.apache.zookeeper.server.quorum.Zab1_0Test.testNormalFollowerRunWithDiff

Error Message:
expected:<4294967298> but was:<0>

Stack Trace:
junit.framework.AssertionFailedError: expected:<4294967298> but was:<0>
	at org.apache.zookeeper.server.quorum.Zab1_0Test$5.converseWithFollower(Zab1_0Test.java:876)
	at org.apache.zookeeper.server.quorum.Zab1_0Test.testFollowerConversation(Zab1_0Test.java:523)
	at org.apache.zookeeper.server.quorum.Zab1_0Test.testNormalFollowerRunWithDiff(Zab1_0Test.java:791)
	at org.apache.zookeeper.JUnit4ZKTestRunner$LoggedInvokeMethod.evaluate(JUnit4ZKTestRunner.java:79)
Mime
  • Unnamed multipart/mixed (inline, None, 0 bytes)
View raw message