zookeeper-dev mailing list archives

Site index · List index
Message view « Date » · « Thread »
Top « Date » · « Thread »
From Apache Jenkins Server <jenk...@builds.apache.org>
Subject ZooKeeper-trunk - Build # 3572 - Failure
Date Tue, 10 Oct 2017 23:28:46 GMT
See https://builds.apache.org/job/ZooKeeper-trunk/3572/

###################################################################################
########################## LAST 60 LINES OF THE CONSOLE ###########################
[...truncated 65.56 MB...]
    [junit] 2017-10-10 23:28:29,270 [myid:] - INFO  [QuorumPeer[myid=5](plain=/127.0.0.1:14076)(secure=disabled):Leader@627]
- Shutting down
    [junit] 2017-10-10 23:28:29,270 [myid:] - WARN  [QuorumPeer[myid=5](plain=/127.0.0.1:14076)(secure=disabled):QuorumPeer@1161]
- PeerState set to LOOKING
    [junit] 2017-10-10 23:28:29,270 [myid:] - WARN  [QuorumPeer[myid=5](plain=/127.0.0.1:14076)(secure=disabled):QuorumPeer@1143]
- QuorumPeer main thread exited
    [junit] 2017-10-10 23:28:29,270 [myid:] - INFO  [QuorumPeer[myid=5](plain=/127.0.0.1:14076)(secure=disabled):MBeanRegistry@128]
- Unregister MBean [org.apache.ZooKeeperService:name0=ReplicatedServer_id5]
    [junit] 2017-10-10 23:28:29,270 [myid:] - INFO  [QuorumPeer[myid=5](plain=/127.0.0.1:14076)(secure=disabled):MBeanRegistry@128]
- Unregister MBean [org.apache.ZooKeeperService:name0=ReplicatedServer_id5,name1=replica.5]
    [junit] 2017-10-10 23:28:29,270 [myid:] - INFO  [QuorumPeer[myid=5](plain=/127.0.0.1:14076)(secure=disabled):MBeanRegistry@128]
- Unregister MBean [org.apache.ZooKeeperService:name0=ReplicatedServer_id5,name1=replica.1]
    [junit] 2017-10-10 23:28:29,270 [myid:] - INFO  [QuorumPeer[myid=5](plain=/127.0.0.1:14076)(secure=disabled):MBeanRegistry@128]
- Unregister MBean [org.apache.ZooKeeperService:name0=ReplicatedServer_id5,name1=replica.2]
    [junit] 2017-10-10 23:28:29,271 [myid:] - INFO  [QuorumPeer[myid=5](plain=/127.0.0.1:14076)(secure=disabled):MBeanRegistry@128]
- Unregister MBean [org.apache.ZooKeeperService:name0=ReplicatedServer_id5,name1=replica.3]
    [junit] 2017-10-10 23:28:29,269 [myid:] - INFO  [/127.0.0.1:14078:QuorumCnxManager$Listener@674]
- Leaving listener
    [junit] 2017-10-10 23:28:29,272 [myid:] - INFO  [main:QuorumUtil@254] - Shutting down
leader election QuorumPeer[myid=5](plain=/127.0.0.1:14076)(secure=disabled)
    [junit] 2017-10-10 23:28:29,272 [myid:] - INFO  [main:QuorumUtil@259] - Waiting for QuorumPeer[myid=5](plain=/127.0.0.1:14076)(secure=disabled)
to exit thread
    [junit] 2017-10-10 23:28:29,272 [myid:] - INFO  [main:FourLetterWordMain@87] - connecting
to 127.0.0.1 14064
    [junit] 2017-10-10 23:28:29,274 [myid:] - INFO  [main:QuorumUtil@243] - 127.0.0.1:14064
is no longer accepting client connections
    [junit] 2017-10-10 23:28:29,274 [myid:] - INFO  [main:FourLetterWordMain@87] - connecting
to 127.0.0.1 14067
    [junit] 2017-10-10 23:28:29,274 [myid:] - INFO  [main:QuorumUtil@243] - 127.0.0.1:14067
is no longer accepting client connections
    [junit] 2017-10-10 23:28:29,274 [myid:] - INFO  [main:FourLetterWordMain@87] - connecting
to 127.0.0.1 14070
    [junit] 2017-10-10 23:28:29,275 [myid:] - INFO  [main:QuorumUtil@243] - 127.0.0.1:14070
is no longer accepting client connections
    [junit] 2017-10-10 23:28:29,275 [myid:] - INFO  [main:FourLetterWordMain@87] - connecting
to 127.0.0.1 14073
    [junit] 2017-10-10 23:28:29,275 [myid:] - INFO  [main:QuorumUtil@243] - 127.0.0.1:14073
is no longer accepting client connections
    [junit] 2017-10-10 23:28:29,275 [myid:] - INFO  [main:FourLetterWordMain@87] - connecting
to 127.0.0.1 14076
    [junit] 2017-10-10 23:28:29,276 [myid:] - INFO  [main:QuorumUtil@243] - 127.0.0.1:14076
is no longer accepting client connections
    [junit] 2017-10-10 23:28:29,277 [myid:] - INFO  [main:ZKTestCase$1@68] - SUCCEEDED testRemoveOneAsynchronous
    [junit] 2017-10-10 23:28:29,277 [myid:] - INFO  [main:ZKTestCase$1@63] - FINISHED testRemoveOneAsynchronous
    [junit] Tests run: 13, Failures: 0, Errors: 0, Skipped: 0, Time elapsed: 278.844 sec,
Thread: 2, Class: org.apache.zookeeper.test.ReconfigTest
    [junit] 2017-10-10 23:28:29,513 [myid:] - INFO  [WorkerSender[myid=5]:FastLeaderElection$Messenger$WorkerSender@470]
- WorkerSender is down
    [junit] 2017-10-10 23:28:29,514 [myid:] - INFO  [WorkerReceiver[myid=5]:FastLeaderElection$Messenger$WorkerReceiver@440]
- WorkerReceiver is down
    [junit] 2017-10-10 23:28:29,519 [myid:] - INFO  [WorkerSender[myid=1]:FastLeaderElection$Messenger$WorkerSender@470]
- WorkerSender is down
    [junit] 2017-10-10 23:28:29,520 [myid:] - INFO  [WorkerSender[myid=3]:FastLeaderElection$Messenger$WorkerSender@470]
- WorkerSender is down
    [junit] 2017-10-10 23:28:29,520 [myid:] - INFO  [WorkerReceiver[myid=1]:FastLeaderElection$Messenger$WorkerReceiver@440]
- WorkerReceiver is down
    [junit] 2017-10-10 23:28:29,520 [myid:] - INFO  [WorkerReceiver[myid=3]:FastLeaderElection$Messenger$WorkerReceiver@440]
- WorkerReceiver is down
    [junit] 2017-10-10 23:28:29,520 [myid:] - INFO  [WorkerReceiver[myid=4]:FastLeaderElection$Messenger$WorkerReceiver@440]
- WorkerReceiver is down
    [junit] 2017-10-10 23:28:29,521 [myid:] - INFO  [WorkerSender[myid=4]:FastLeaderElection$Messenger$WorkerSender@470]
- WorkerSender is down
    [junit] 2017-10-10 23:28:29,528 [myid:] - INFO  [WorkerSender[myid=2]:FastLeaderElection$Messenger$WorkerSender@470]
- WorkerSender is down
    [junit] 2017-10-10 23:28:29,528 [myid:] - INFO  [WorkerReceiver[myid=2]:FastLeaderElection$Messenger$WorkerReceiver@440]
- WorkerReceiver is down

fail.build.on.test.failure:

BUILD FAILED
/home/jenkins/jenkins-slave/workspace/ZooKeeper-trunk/build.xml:1382: The following error
occurred while executing this line:
/home/jenkins/jenkins-slave/workspace/ZooKeeper-trunk/build.xml:1263: The following error
occurred while executing this line:
/home/jenkins/jenkins-slave/workspace/ZooKeeper-trunk/build.xml:1267: Tests failed!

Total time: 11 minutes 58 seconds
Build step 'Execute shell' marked build as failure
[FINDBUGS] Skipping publisher since build result is FAILURE
[WARNINGS] Skipping publisher since build result is FAILURE
Archiving artifacts
Setting JDK_1_7_LATEST__HOME=/home/jenkins/tools/java/latest1.7
Recording fingerprints
Setting JDK_1_7_LATEST__HOME=/home/jenkins/tools/java/latest1.7
Recording test results
Setting JDK_1_7_LATEST__HOME=/home/jenkins/tools/java/latest1.7
Publishing Javadoc
Setting JDK_1_7_LATEST__HOME=/home/jenkins/tools/java/latest1.7
Setting JDK_1_7_LATEST__HOME=/home/jenkins/tools/java/latest1.7
Email was triggered for: Failure - Any
Sending email for trigger: Failure - Any
Setting JDK_1_7_LATEST__HOME=/home/jenkins/tools/java/latest1.7
Setting JDK_1_7_LATEST__HOME=/home/jenkins/tools/java/latest1.7



###################################################################################
############################## FAILED TESTS (if any) ##############################
1 tests failed.
FAILED:  org.apache.zookeeper.test.SSLTest.testSecureQuorumServer

Error Message:
waiting for server 0 being up

Stack Trace:
junit.framework.AssertionFailedError: waiting for server 0 being up
	at org.apache.zookeeper.test.SSLTest.testSecureQuorumServer(SSLTest.java:96)
	at org.apache.zookeeper.JUnit4ZKTestRunner$LoggedInvokeMethod.evaluate(JUnit4ZKTestRunner.java:79)
Mime
  • Unnamed multipart/mixed (inline, None, 0 bytes)
View raw message