zookeeper-dev mailing list archives

Site index · List index
Message view « Date » · « Thread »
Top « Date » · « Thread »
From Apache Jenkins Server <jenk...@builds.apache.org>
Subject ZooKeeper-trunk - Build # 3573 - Still Failing
Date Wed, 11 Oct 2017 14:24:54 GMT
See https://builds.apache.org/job/ZooKeeper-trunk/3573/

###################################################################################
########################## LAST 60 LINES OF THE CONSOLE ###########################
[...truncated 45.79 MB...]
    [junit] 2017-10-11 14:24:45,140 [myid:] - INFO  [main:SessionTrackerImpl@232] - Shutting
down
    [junit] 2017-10-11 14:24:45,140 [myid:] - INFO  [main:PrepRequestProcessor@1010] - Shutting
down
    [junit] 2017-10-11 14:24:45,140 [myid:] - INFO  [main:SyncRequestProcessor@191] - Shutting
down
    [junit] 2017-10-11 14:24:45,140 [myid:] - INFO  [ProcessThread(sid:0 cport:11468)::PrepRequestProcessor@155]
- PrepRequestProcessor exited loop!
    [junit] 2017-10-11 14:24:45,140 [myid:] - INFO  [SyncThread:0:SyncRequestProcessor@169]
- SyncRequestProcessor exited!
    [junit] 2017-10-11 14:24:45,141 [myid:] - INFO  [main:FinalRequestProcessor@481] - shutdown
of request processor complete
    [junit] 2017-10-11 14:24:45,141 [myid:] - INFO  [main:MBeanRegistry@128] - Unregister
MBean [org.apache.ZooKeeperService:name0=StandaloneServer_port11468,name1=InMemoryDataTree]
    [junit] 2017-10-11 14:24:45,141 [myid:] - INFO  [main:MBeanRegistry@128] - Unregister
MBean [org.apache.ZooKeeperService:name0=StandaloneServer_port11468]
    [junit] 2017-10-11 14:24:45,142 [myid:] - INFO  [main:FourLetterWordMain@87] - connecting
to 127.0.0.1 11468
    [junit] 2017-10-11 14:24:45,142 [myid:] - INFO  [main:JMXEnv@146] - ensureOnly:[]
    [junit] 2017-10-11 14:24:45,154 [myid:] - INFO  [main:ClientBase@626] - fdcount after
test is: 7143 at start it was 7143
    [junit] 2017-10-11 14:24:45,154 [myid:] - INFO  [main:ZKTestCase$1@68] - SUCCEEDED testWatcherAutoResetWithLocal
    [junit] 2017-10-11 14:24:45,154 [myid:] - INFO  [main:ZKTestCase$1@63] - FINISHED testWatcherAutoResetWithLocal
    [junit] Tests run: 105, Failures: 0, Errors: 0, Skipped: 0, Time elapsed: 424.489 sec,
Thread: 1, Class: org.apache.zookeeper.test.NioNettySuiteTest
    [junit] 2017-10-11 14:24:45,223 [myid:] - INFO  [SessionTracker:SessionTrackerImpl@158]
- SessionTrackerImpl exited loop!
    [junit] 2017-10-11 14:24:45,223 [myid:] - INFO  [SessionTracker:SessionTrackerImpl@158]
- SessionTrackerImpl exited loop!
    [junit] 2017-10-11 14:24:45,301 [myid:127.0.0.1:11222] - INFO  [main-SendThread(127.0.0.1:11222):ClientCnxn$SendThread@1113]
- Opening socket connection to server 127.0.0.1/127.0.0.1:11222. Will not attempt to authenticate
using SASL (unknown error)
    [junit] 2017-10-11 14:24:45,302 [myid:127.0.0.1:11222] - WARN  [main-SendThread(127.0.0.1:11222):ClientCnxn$SendThread@1235]
- Session 0x107357ca3f20000 for server 127.0.0.1/127.0.0.1:11222, unexpected error, closing
socket connection and attempting reconnect
    [junit] java.net.ConnectException: Connection refused
    [junit] 	at sun.nio.ch.SocketChannelImpl.checkConnect(Native Method)
    [junit] 	at sun.nio.ch.SocketChannelImpl.finishConnect(SocketChannelImpl.java:744)
    [junit] 	at org.apache.zookeeper.ClientCnxnSocketNIO.doTransport(ClientCnxnSocketNIO.java:357)
    [junit] 	at org.apache.zookeeper.ClientCnxn$SendThread.run(ClientCnxn.java:1214)
    [junit] 2017-10-11 14:24:45,374 [myid:127.0.0.1:11351] - INFO  [main-SendThread(127.0.0.1:11351):ClientCnxn$SendThread@1113]
- Opening socket connection to server 127.0.0.1/127.0.0.1:11351. Will not attempt to authenticate
using SASL (unknown error)
    [junit] 2017-10-11 14:24:45,374 [myid:127.0.0.1:11351] - WARN  [main-SendThread(127.0.0.1:11351):ClientCnxn$SendThread@1235]
- Session 0x307357f8f590000 for server 127.0.0.1/127.0.0.1:11351, unexpected error, closing
socket connection and attempting reconnect
    [junit] java.net.ConnectException: Connection refused
    [junit] 	at sun.nio.ch.SocketChannelImpl.checkConnect(Native Method)
    [junit] 	at sun.nio.ch.SocketChannelImpl.finishConnect(SocketChannelImpl.java:744)
    [junit] 	at org.apache.zookeeper.ClientCnxnSocketNIO.doTransport(ClientCnxnSocketNIO.java:357)
    [junit] 	at org.apache.zookeeper.ClientCnxn$SendThread.run(ClientCnxn.java:1214)
    [junit] 2017-10-11 14:24:45,566 [myid:127.0.0.1:11271] - INFO  [main-SendThread(127.0.0.1:11271):ClientCnxn$SendThread@1113]
- Opening socket connection to server 127.0.0.1/127.0.0.1:11271. Will not attempt to authenticate
using SASL (unknown error)
    [junit] 2017-10-11 14:24:45,566 [myid:127.0.0.1:11271] - WARN  [main-SendThread(127.0.0.1:11271):ClientCnxn$SendThread@1235]
- Session 0x107357cf3b80001 for server 127.0.0.1/127.0.0.1:11271, unexpected error, closing
socket connection and attempting reconnect
    [junit] java.net.ConnectException: Connection refused
    [junit] 	at sun.nio.ch.SocketChannelImpl.checkConnect(Native Method)
    [junit] 	at sun.nio.ch.SocketChannelImpl.finishConnect(SocketChannelImpl.java:744)
    [junit] 	at org.apache.zookeeper.ClientCnxnSocketNIO.doTransport(ClientCnxnSocketNIO.java:357)
    [junit] 	at org.apache.zookeeper.ClientCnxn$SendThread.run(ClientCnxn.java:1214)

BUILD FAILED
/home/jenkins/jenkins-slave/workspace/ZooKeeper-trunk/build.xml:1382: The following error
occurred while executing this line:
/home/jenkins/jenkins-slave/workspace/ZooKeeper-trunk/build.xml:1248: /home/jenkins/jenkins-slave/workspace/ZooKeeper-trunk/build.xml:1248:
Process fork failed.

Total time: 10 minutes 3 seconds
Build step 'Execute shell' marked build as failure
[FINDBUGS] Skipping publisher since build result is FAILURE
[WARNINGS] Skipping publisher since build result is FAILURE
Archiving artifacts
Setting JDK_1_7_LATEST__HOME=/home/jenkins/tools/java/latest1.7
Recording fingerprints
Setting JDK_1_7_LATEST__HOME=/home/jenkins/tools/java/latest1.7
Recording test results
Setting JDK_1_7_LATEST__HOME=/home/jenkins/tools/java/latest1.7
Publishing Javadoc
Setting JDK_1_7_LATEST__HOME=/home/jenkins/tools/java/latest1.7
Setting JDK_1_7_LATEST__HOME=/home/jenkins/tools/java/latest1.7
Email was triggered for: Failure - Any
Sending email for trigger: Failure - Any
Setting JDK_1_7_LATEST__HOME=/home/jenkins/tools/java/latest1.7
Setting JDK_1_7_LATEST__HOME=/home/jenkins/tools/java/latest1.7



###################################################################################
############################## FAILED TESTS (if any) ##############################
2 tests failed.
FAILED:  org.apache.zookeeper.test.QuorumMajorityTest.unknown

Error Message:
Forked Java VM exited abnormally. Please note the time in the report does not reflect the
time until the VM exit.

Stack Trace:
junit.framework.AssertionFailedError: Forked Java VM exited abnormally. Please note the time
in the report does not reflect the time until the VM exit.
	at java.lang.Thread.run(Thread.java:745)


FAILED:  org.apache.zookeeper.test.QuorumQuotaTest.unknown

Error Message:
Forked Java VM exited abnormally. Please note the time in the report does not reflect the
time until the VM exit.

Stack Trace:
junit.framework.AssertionFailedError: Forked Java VM exited abnormally. Please note the time
in the report does not reflect the time until the VM exit.
	at java.lang.Thread.run(Thread.java:745)
Mime
  • Unnamed multipart/mixed (inline, None, 0 bytes)
View raw message