zookeeper-dev mailing list archives

Site index · List index
Message view « Date » · « Thread »
Top « Date » · « Thread »
From Apache Jenkins Server <jenk...@builds.apache.org>
Subject ZooKeeper_branch35_openjdk7 - Build # 704 - Failure
Date Sun, 08 Oct 2017 10:08:02 GMT
See https://builds.apache.org/job/ZooKeeper_branch35_openjdk7/704/

###################################################################################
########################## LAST 60 LINES OF THE CONSOLE ###########################
[...truncated 67.60 MB...]
    [junit] 	at org.apache.zookeeper.ClientCnxn$SendThread.run(ClientCnxn.java:1214)
    [junit] 2017-10-08 10:07:57,510 [myid:] - INFO  [ProcessThread(sid:0 cport:24933)::PrepRequestProcessor@611]
- Processed session termination for sessionid: 0x103ea70ed010000
    [junit] 2017-10-08 10:07:57,513 [myid:] - INFO  [SyncThread:0:MBeanRegistry@128] - Unregister
MBean [org.apache.ZooKeeperService:name0=StandaloneServer_port24933,name1=Connections,name2=127.0.0.1,name3=0x103ea70ed010000]
    [junit] 2017-10-08 10:07:57,514 [myid:] - INFO  [main:ZooKeeper@1334] - Session: 0x103ea70ed010000
closed
    [junit] 2017-10-08 10:07:57,514 [myid:] - INFO  [main-EventThread:ClientCnxn$EventThread@513]
- EventThread shut down for session: 0x103ea70ed010000
    [junit] 2017-10-08 10:07:57,514 [myid:] - INFO  [main:JUnit4ZKTestRunner$LoggedInvokeMethod@82]
- Memory used 68811
    [junit] 2017-10-08 10:07:57,515 [myid:] - INFO  [main:JUnit4ZKTestRunner$LoggedInvokeMethod@87]
- Number of threads 472
    [junit] 2017-10-08 10:07:57,515 [myid:] - INFO  [main:JUnit4ZKTestRunner$LoggedInvokeMethod@102]
- FINISHED TEST METHOD testWatcherAutoResetWithLocal
    [junit] 2017-10-08 10:07:57,515 [myid:] - INFO  [main:ClientBase@586] - tearDown starting
    [junit] 2017-10-08 10:07:57,515 [myid:] - INFO  [main:ClientBase@556] - STOPPING server
    [junit] 2017-10-08 10:07:57,516 [myid:] - INFO  [main:NettyServerCnxnFactory@464] - shutdown
called 0.0.0.0/0.0.0.0:24933
    [junit] 2017-10-08 10:07:57,519 [myid:] - INFO  [main:ZooKeeperServer@541] - shutting
down
    [junit] 2017-10-08 10:07:57,520 [myid:] - ERROR [main:ZooKeeperServer@505] - ZKShutdownHandler
is not registered, so ZooKeeper server won't take any action on ERROR or SHUTDOWN server state
changes
    [junit] 2017-10-08 10:07:57,520 [myid:] - INFO  [main:SessionTrackerImpl@232] - Shutting
down
    [junit] 2017-10-08 10:07:57,520 [myid:] - INFO  [main:PrepRequestProcessor@1005] - Shutting
down
    [junit] 2017-10-08 10:07:57,521 [myid:] - INFO  [main:SyncRequestProcessor@191] - Shutting
down
    [junit] 2017-10-08 10:07:57,521 [myid:] - INFO  [ProcessThread(sid:0 cport:24933)::PrepRequestProcessor@155]
- PrepRequestProcessor exited loop!
    [junit] 2017-10-08 10:07:57,521 [myid:] - INFO  [SyncThread:0:SyncRequestProcessor@169]
- SyncRequestProcessor exited!
    [junit] 2017-10-08 10:07:57,521 [myid:] - INFO  [main:FinalRequestProcessor@481] - shutdown
of request processor complete
    [junit] 2017-10-08 10:07:57,522 [myid:] - INFO  [main:MBeanRegistry@128] - Unregister
MBean [org.apache.ZooKeeperService:name0=StandaloneServer_port24933,name1=InMemoryDataTree]
    [junit] 2017-10-08 10:07:57,522 [myid:] - INFO  [main:MBeanRegistry@128] - Unregister
MBean [org.apache.ZooKeeperService:name0=StandaloneServer_port24933]
    [junit] 2017-10-08 10:07:57,522 [myid:] - INFO  [main:FourLetterWordMain@87] - connecting
to 127.0.0.1 24933
    [junit] 2017-10-08 10:07:57,523 [myid:] - INFO  [main:JMXEnv@146] - ensureOnly:[]
    [junit] 2017-10-08 10:07:57,530 [myid:] - INFO  [main:ClientBase@611] - fdcount after
test is: 1414 at start it was 1414
    [junit] 2017-10-08 10:07:57,530 [myid:] - INFO  [main:ZKTestCase$1@68] - SUCCEEDED testWatcherAutoResetWithLocal
    [junit] 2017-10-08 10:07:57,530 [myid:] - INFO  [main:ZKTestCase$1@63] - FINISHED testWatcherAutoResetWithLocal
    [junit] Tests run: 103, Failures: 0, Errors: 0, Skipped: 0, Time elapsed: 439.972 sec,
Thread: 6, Class: org.apache.zookeeper.test.NioNettySuiteTest
    [junit] 2017-10-08 10:07:58,068 [myid:127.0.0.1:24736] - INFO  [main-SendThread(127.0.0.1:24736):ClientCnxn$SendThread@1113]
- Opening socket connection to server 127.0.0.1/127.0.0.1:24736. Will not attempt to authenticate
using SASL (unknown error)
    [junit] 2017-10-08 10:07:58,070 [myid:127.0.0.1:24736] - WARN  [main-SendThread(127.0.0.1:24736):ClientCnxn$SendThread@1235]
- Session 0x103ea6aa1dc0001 for server 127.0.0.1/127.0.0.1:24736, unexpected error, closing
socket connection and attempting reconnect
    [junit] java.net.ConnectException: Connection refused
    [junit] 	at sun.nio.ch.SocketChannelImpl.checkConnect(Native Method)
    [junit] 	at sun.nio.ch.SocketChannelImpl.finishConnect(SocketChannelImpl.java:744)
    [junit] 	at org.apache.zookeeper.ClientCnxnSocketNIO.doTransport(ClientCnxnSocketNIO.java:357)
    [junit] 	at org.apache.zookeeper.ClientCnxn$SendThread.run(ClientCnxn.java:1214)
    [junit] 2017-10-08 10:07:58,092 [myid:] - INFO  [SessionTracker:SessionTrackerImpl@158]
- SessionTrackerImpl exited loop!
    [junit] 2017-10-08 10:07:58,092 [myid:] - INFO  [SessionTracker:SessionTrackerImpl@158]
- SessionTrackerImpl exited loop!
    [junit] 2017-10-08 10:07:58,261 [myid:127.0.0.1:24751] - INFO  [main-SendThread(127.0.0.1:24751):ClientCnxn$SendThread@1113]
- Opening socket connection to server 127.0.0.1/127.0.0.1:24751. Will not attempt to authenticate
using SASL (unknown error)
    [junit] 2017-10-08 10:07:58,262 [myid:127.0.0.1:24751] - WARN  [main-SendThread(127.0.0.1:24751):ClientCnxn$SendThread@1235]
- Session 0x103ea6b016e0000 for server 127.0.0.1/127.0.0.1:24751, unexpected error, closing
socket connection and attempting reconnect
    [junit] java.net.ConnectException: Connection refused
    [junit] 	at sun.nio.ch.SocketChannelImpl.checkConnect(Native Method)
    [junit] 	at sun.nio.ch.SocketChannelImpl.finishConnect(SocketChannelImpl.java:744)
    [junit] 	at org.apache.zookeeper.ClientCnxnSocketNIO.doTransport(ClientCnxnSocketNIO.java:357)
    [junit] 	at org.apache.zookeeper.ClientCnxn$SendThread.run(ClientCnxn.java:1214)

fail.build.on.test.failure:

BUILD FAILED
/home/jenkins/jenkins-slave/workspace/ZooKeeper_branch35_openjdk7/build.xml:1267: The following
error occurred while executing this line:
/home/jenkins/jenkins-slave/workspace/ZooKeeper_branch35_openjdk7/build.xml:1271: Tests failed!

Total time: 11 minutes 47 seconds
Build step 'Invoke Ant' marked build as failure
Recording test results
Setting OPENJDK_7_ON_UBUNTU_ONLY__HOME=/usr/lib/jvm/java-7-openjdk-amd64/
Setting OPENJDK_7_ON_UBUNTU_ONLY__HOME=/usr/lib/jvm/java-7-openjdk-amd64/
Email was triggered for: Failure - Any
Sending email for trigger: Failure - Any
Setting OPENJDK_7_ON_UBUNTU_ONLY__HOME=/usr/lib/jvm/java-7-openjdk-amd64/
Setting OPENJDK_7_ON_UBUNTU_ONLY__HOME=/usr/lib/jvm/java-7-openjdk-amd64/



###################################################################################
############################## FAILED TESTS (if any) ##############################
1 tests failed.
FAILED:  org.apache.zookeeper.test.AsyncHammerTest.testHammer

Error Message:
null

Stack Trace:
junit.framework.AssertionFailedError
	at org.apache.zookeeper.test.AsyncHammerTest.testHammer(AsyncHammerTest.java:185)
	at org.apache.zookeeper.JUnit4ZKTestRunner$LoggedInvokeMethod.evaluate(JUnit4ZKTestRunner.java:79)
Mime
  • Unnamed multipart/mixed (inline, None, 0 bytes)
View raw message