zookeeper-dev mailing list archives

Site index · List index
Message view « Date » · « Thread »
Top « Date » · « Thread »
From Apache Jenkins Server <jenk...@builds.apache.org>
Subject ZooKeeper-trunk - Build # 3581 - Failure
Date Tue, 17 Oct 2017 23:34:31 GMT
See https://builds.apache.org/job/ZooKeeper-trunk/3581/

###################################################################################
########################## LAST 60 LINES OF THE CONSOLE ###########################
[...truncated 62.12 MB...]
    [junit] 2017-10-17 23:34:21,644 [myid:] - INFO  [main:JUnit4ZKTestRunner$LoggedInvokeMethod@87]
- Number of threads 55
    [junit] 2017-10-17 23:34:21,644 [myid:] - INFO  [main:JUnit4ZKTestRunner$LoggedInvokeMethod@102]
- FINISHED TEST METHOD testManyChildWatchersAutoReset
    [junit] 2017-10-17 23:34:21,645 [myid:] - INFO  [main:ClientBase@601] - tearDown starting
    [junit] 2017-10-17 23:34:21,645 [myid:] - INFO  [ProcessThread(sid:0 cport:30076)::PrepRequestProcessor@614]
- Processed session termination for sessionid: 0x100ca1728bb0000
    [junit] 2017-10-17 23:34:21,669 [myid:] - INFO  [main:ZooKeeper@1332] - Session: 0x100ca1728bb0000
closed
    [junit] 2017-10-17 23:34:21,669 [myid:] - INFO  [main-EventThread:ClientCnxn$EventThread@513]
- EventThread shut down for session: 0x100ca1728bb0000
    [junit] 2017-10-17 23:34:21,670 [myid:] - INFO  [ProcessThread(sid:0 cport:30076)::PrepRequestProcessor@614]
- Processed session termination for sessionid: 0x100ca1728bb0001
    [junit] 2017-10-17 23:34:21,669 [myid:] - INFO  [NIOWorkerThread-32:MBeanRegistry@128]
- Unregister MBean [org.apache.ZooKeeperService:name0=StandaloneServer_port30076,name1=Connections,name2=127.0.0.1,name3=0x100ca1728bb0000]
    [junit] 2017-10-17 23:34:21,671 [myid:] - INFO  [NIOWorkerThread-32:NIOServerCnxn@627]
- Closed socket connection for client /127.0.0.1:40993 which had sessionid 0x100ca1728bb0000
    [junit] 2017-10-17 23:34:21,752 [myid:] - INFO  [main:ZooKeeper@1332] - Session: 0x100ca1728bb0001
closed
    [junit] 2017-10-17 23:34:21,753 [myid:] - INFO  [main:ClientBase@571] - STOPPING server
    [junit] 2017-10-17 23:34:21,752 [myid:] - INFO  [main-EventThread:ClientCnxn$EventThread@513]
- EventThread shut down for session: 0x100ca1728bb0001
    [junit] 2017-10-17 23:34:21,752 [myid:] - INFO  [NIOWorkerThread-26:MBeanRegistry@128]
- Unregister MBean [org.apache.ZooKeeperService:name0=StandaloneServer_port30076,name1=Connections,name2=127.0.0.1,name3=0x100ca1728bb0001]
    [junit] 2017-10-17 23:34:21,753 [myid:] - INFO  [NIOWorkerThread-26:NIOServerCnxn@627]
- Closed socket connection for client /127.0.0.1:41006 which had sessionid 0x100ca1728bb0001
    [junit] 2017-10-17 23:34:21,754 [myid:] - INFO  [ConnnectionExpirer:NIOServerCnxnFactory$ConnectionExpirerThread@583]
- ConnnectionExpirerThread interrupted
    [junit] 2017-10-17 23:34:21,755 [myid:] - INFO  [NIOServerCxnFactory.AcceptThread:0.0.0.0/0.0.0.0:30076:NIOServerCnxnFactory$AcceptThread@219]
- accept thread exitted run method
    [junit] 2017-10-17 23:34:21,756 [myid:] - INFO  [NIOServerCxnFactory.SelectorThread-1:NIOServerCnxnFactory$SelectorThread@420]
- selector thread exitted run method
    [junit] 2017-10-17 23:34:21,757 [myid:] - INFO  [NIOServerCxnFactory.SelectorThread-0:NIOServerCnxnFactory$SelectorThread@420]
- selector thread exitted run method
    [junit] 2017-10-17 23:34:21,759 [myid:] - INFO  [main:ZooKeeperServer@545] - shutting
down
    [junit] 2017-10-17 23:34:21,760 [myid:] - ERROR [main:ZooKeeperServer@509] - ZKShutdownHandler
is not registered, so ZooKeeper server won't take any action on ERROR or SHUTDOWN server state
changes
    [junit] 2017-10-17 23:34:21,760 [myid:] - INFO  [main:SessionTrackerImpl@232] - Shutting
down
    [junit] 2017-10-17 23:34:21,760 [myid:] - INFO  [main:PrepRequestProcessor@1010] - Shutting
down
    [junit] 2017-10-17 23:34:21,760 [myid:] - INFO  [main:SyncRequestProcessor@191] - Shutting
down
    [junit] 2017-10-17 23:34:21,760 [myid:] - INFO  [ProcessThread(sid:0 cport:30076)::PrepRequestProcessor@155]
- PrepRequestProcessor exited loop!
    [junit] 2017-10-17 23:34:21,760 [myid:] - INFO  [SyncThread:0:SyncRequestProcessor@169]
- SyncRequestProcessor exited!
    [junit] 2017-10-17 23:34:21,760 [myid:] - INFO  [main:FinalRequestProcessor@481] - shutdown
of request processor complete
    [junit] 2017-10-17 23:34:21,761 [myid:] - INFO  [main:MBeanRegistry@128] - Unregister
MBean [org.apache.ZooKeeperService:name0=StandaloneServer_port30076,name1=InMemoryDataTree]
    [junit] 2017-10-17 23:34:21,761 [myid:] - INFO  [main:MBeanRegistry@128] - Unregister
MBean [org.apache.ZooKeeperService:name0=StandaloneServer_port30076]
    [junit] 2017-10-17 23:34:21,761 [myid:] - INFO  [main:FourLetterWordMain@87] - connecting
to 127.0.0.1 30076
    [junit] 2017-10-17 23:34:21,762 [myid:] - INFO  [main:JMXEnv@146] - ensureOnly:[]
    [junit] 2017-10-17 23:34:21,838 [myid:] - INFO  [main:ClientBase@626] - fdcount after
test is: 49 at start it was 53
    [junit] 2017-10-17 23:34:21,838 [myid:] - INFO  [main:ZKTestCase$1@68] - SUCCEEDED testManyChildWatchersAutoReset
    [junit] 2017-10-17 23:34:21,839 [myid:] - INFO  [main:ZKTestCase$1@63] - FINISHED testManyChildWatchersAutoReset
    [junit] Tests run: 4, Failures: 0, Errors: 0, Skipped: 0, Time elapsed: 810.417 sec, Thread:
8, Class: org.apache.zookeeper.test.DisconnectedWatcherTest

fail.build.on.test.failure:

BUILD FAILED
/home/jenkins/jenkins-slave/workspace/ZooKeeper-trunk/build.xml:1386: The following error
occurred while executing this line:
/home/jenkins/jenkins-slave/workspace/ZooKeeper-trunk/build.xml:1267: The following error
occurred while executing this line:
/home/jenkins/jenkins-slave/workspace/ZooKeeper-trunk/build.xml:1271: Tests failed!

Total time: 17 minutes 21 seconds
Build step 'Execute shell' marked build as failure
[FINDBUGS] Skipping publisher since build result is FAILURE
[WARNINGS] Skipping publisher since build result is FAILURE
Archiving artifacts
Setting JDK_1_7_LATEST__HOME=/home/jenkins/tools/java/latest1.7
Recording fingerprints
Setting JDK_1_7_LATEST__HOME=/home/jenkins/tools/java/latest1.7
Recording test results
Setting JDK_1_7_LATEST__HOME=/home/jenkins/tools/java/latest1.7
Publishing Javadoc
Setting JDK_1_7_LATEST__HOME=/home/jenkins/tools/java/latest1.7
Setting JDK_1_7_LATEST__HOME=/home/jenkins/tools/java/latest1.7
Email was triggered for: Failure - Any
Sending email for trigger: Failure - Any
Setting JDK_1_7_LATEST__HOME=/home/jenkins/tools/java/latest1.7
Setting JDK_1_7_LATEST__HOME=/home/jenkins/tools/java/latest1.7



###################################################################################
############################## FAILED TESTS (if any) ##############################
1 tests failed.
FAILED:  org.apache.zookeeper.test.WatchEventWhenAutoResetTest.testNodeDataChanged

Error Message:
expected:<NodeDataChanged> but was:<NodeDeleted>

Stack Trace:
junit.framework.AssertionFailedError: expected:<NodeDataChanged> but was:<NodeDeleted>
	at org.apache.zookeeper.test.WatchEventWhenAutoResetTest$EventsWatcher.assertEvent(WatchEventWhenAutoResetTest.java:67)
	at org.apache.zookeeper.test.WatchEventWhenAutoResetTest.testNodeDataChanged(WatchEventWhenAutoResetTest.java:126)
	at org.apache.zookeeper.JUnit4ZKTestRunner$LoggedInvokeMethod.evaluate(JUnit4ZKTestRunner.java:79)
Mime
  • Unnamed multipart/mixed (inline, None, 0 bytes)
View raw message