zookeeper-dev mailing list archives

Site index · List index
Message view « Date » · « Thread »
Top « Date » · « Thread »
From Apache Jenkins Server <jenk...@builds.apache.org>
Subject ZooKeeper-trunk-jdk8 - Build # 1230 - Failure
Date Fri, 06 Oct 2017 11:53:58 GMT
See https://builds.apache.org/job/ZooKeeper-trunk-jdk8/1230/

###################################################################################
########################## LAST 60 LINES OF THE CONSOLE ###########################
[...truncated 66.06 MB...]
    [junit] 2017-10-06 11:53:55,659 [myid:] - INFO  [SyncThread:0:MBeanRegistry@128] - Unregister
MBean [org.apache.ZooKeeperService:name0=StandaloneServer_port16854,name1=Connections,name2=127.0.0.1,name3=0x1071b6d08b10000]
    [junit] 2017-10-06 11:53:55,659 [myid:] - INFO  [main:ZooKeeper@1332] - Session: 0x1071b6d08b10000
closed
    [junit] 2017-10-06 11:53:55,659 [myid:] - INFO  [main-EventThread:ClientCnxn$EventThread@513]
- EventThread shut down for session: 0x1071b6d08b10000
    [junit] 2017-10-06 11:53:55,659 [myid:] - INFO  [main:JUnit4ZKTestRunner$LoggedInvokeMethod@82]
- Memory used 237134
    [junit] 2017-10-06 11:53:55,659 [myid:] - INFO  [main:JUnit4ZKTestRunner$LoggedInvokeMethod@87]
- Number of threads 2431
    [junit] 2017-10-06 11:53:55,659 [myid:] - INFO  [main:JUnit4ZKTestRunner$LoggedInvokeMethod@102]
- FINISHED TEST METHOD testWatcherAutoResetWithLocal
    [junit] 2017-10-06 11:53:55,659 [myid:] - INFO  [main:ClientBase@601] - tearDown starting
    [junit] 2017-10-06 11:53:55,659 [myid:] - INFO  [main:ClientBase@571] - STOPPING server
    [junit] 2017-10-06 11:53:55,660 [myid:] - INFO  [main:NettyServerCnxnFactory@464] - shutdown
called 0.0.0.0/0.0.0.0:16854
    [junit] 2017-10-06 11:53:55,663 [myid:] - INFO  [main:ZooKeeperServer@545] - shutting
down
    [junit] 2017-10-06 11:53:55,663 [myid:] - ERROR [main:ZooKeeperServer@509] - ZKShutdownHandler
is not registered, so ZooKeeper server won't take any action on ERROR or SHUTDOWN server state
changes
    [junit] 2017-10-06 11:53:55,663 [myid:] - INFO  [main:SessionTrackerImpl@232] - Shutting
down
    [junit] 2017-10-06 11:53:55,663 [myid:] - INFO  [main:PrepRequestProcessor@1010] - Shutting
down
    [junit] 2017-10-06 11:53:55,664 [myid:] - INFO  [main:SyncRequestProcessor@191] - Shutting
down
    [junit] 2017-10-06 11:53:55,664 [myid:] - INFO  [ProcessThread(sid:0 cport:16854)::PrepRequestProcessor@155]
- PrepRequestProcessor exited loop!
    [junit] 2017-10-06 11:53:55,664 [myid:] - INFO  [SyncThread:0:SyncRequestProcessor@169]
- SyncRequestProcessor exited!
    [junit] 2017-10-06 11:53:55,664 [myid:] - INFO  [main:FinalRequestProcessor@481] - shutdown
of request processor complete
    [junit] 2017-10-06 11:53:55,664 [myid:] - INFO  [main:MBeanRegistry@128] - Unregister
MBean [org.apache.ZooKeeperService:name0=StandaloneServer_port16854,name1=InMemoryDataTree]
    [junit] 2017-10-06 11:53:55,664 [myid:] - INFO  [main:MBeanRegistry@128] - Unregister
MBean [org.apache.ZooKeeperService:name0=StandaloneServer_port16854]
    [junit] 2017-10-06 11:53:55,733 [myid:] - INFO  [main:FourLetterWordMain@87] - connecting
to 127.0.0.1 16854
    [junit] 2017-10-06 11:53:55,734 [myid:] - INFO  [main:JMXEnv@146] - ensureOnly:[]
    [junit] 2017-10-06 11:53:55,745 [myid:] - INFO  [main:ClientBase@626] - fdcount after
test is: 7153 at start it was 7153
    [junit] 2017-10-06 11:53:55,745 [myid:] - INFO  [main:ZKTestCase$1@68] - SUCCEEDED testWatcherAutoResetWithLocal
    [junit] 2017-10-06 11:53:55,745 [myid:] - INFO  [main:ZKTestCase$1@63] - FINISHED testWatcherAutoResetWithLocal
    [junit] 2017-10-06 11:53:55,781 [myid:127.0.0.1:16608] - INFO  [main-SendThread(127.0.0.1:16608):ClientCnxn$SendThread@1113]
- Opening socket connection to server 127.0.0.1/127.0.0.1:16608. Will not attempt to authenticate
using SASL (unknown error)
    [junit] 2017-10-06 11:53:55,781 [myid:127.0.0.1:16608] - WARN  [main-SendThread(127.0.0.1:16608):ClientCnxn$SendThread@1235]
- Session 0x1071b66cf2a0000 for server 127.0.0.1/127.0.0.1:16608, unexpected error, closing
socket connection and attempting reconnect
    [junit] java.net.ConnectException: Connection refused
    [junit] 	at sun.nio.ch.SocketChannelImpl.checkConnect(Native Method)
    [junit] 	at sun.nio.ch.SocketChannelImpl.finishConnect(SocketChannelImpl.java:717)
    [junit] 	at org.apache.zookeeper.ClientCnxnSocketNIO.doTransport(ClientCnxnSocketNIO.java:357)
    [junit] 	at org.apache.zookeeper.ClientCnxn$SendThread.run(ClientCnxn.java:1214)
    [junit] Tests run: 105, Failures: 0, Errors: 0, Skipped: 0, Time elapsed: 414.565 sec,
Thread: 3, Class: org.apache.zookeeper.test.NioNettySuiteTest
    [junit] 2017-10-06 11:53:56,025 [myid:127.0.0.1:16734] - INFO  [main-SendThread(127.0.0.1:16734):ClientCnxn$SendThread@1113]
- Opening socket connection to server 127.0.0.1/127.0.0.1:16734. Will not attempt to authenticate
using SASL (unknown error)
    [junit] 2017-10-06 11:53:56,026 [myid:127.0.0.1:16734] - WARN  [main-SendThread(127.0.0.1:16734):ClientCnxn$SendThread@1235]
- Session 0x2071b69a8600000 for server 127.0.0.1/127.0.0.1:16734, unexpected error, closing
socket connection and attempting reconnect
    [junit] java.net.ConnectException: Connection refused
    [junit] 	at sun.nio.ch.SocketChannelImpl.checkConnect(Native Method)
    [junit] 	at sun.nio.ch.SocketChannelImpl.finishConnect(SocketChannelImpl.java:717)
    [junit] 	at org.apache.zookeeper.ClientCnxnSocketNIO.doTransport(ClientCnxnSocketNIO.java:357)
    [junit] 	at org.apache.zookeeper.ClientCnxn$SendThread.run(ClientCnxn.java:1214)
    [junit] 2017-10-06 11:53:56,133 [myid:127.0.0.1:16731] - INFO  [main-SendThread(127.0.0.1:16731):ClientCnxn$SendThread@1113]
- Opening socket connection to server 127.0.0.1/127.0.0.1:16731. Will not attempt to authenticate
using SASL (unknown error)
    [junit] 2017-10-06 11:53:56,133 [myid:127.0.0.1:16731] - WARN  [main-SendThread(127.0.0.1:16731):ClientCnxn$SendThread@1235]
- Session 0x1071b69a8bb0000 for server 127.0.0.1/127.0.0.1:16731, unexpected error, closing
socket connection and attempting reconnect
    [junit] java.net.ConnectException: Connection refused
    [junit] 	at sun.nio.ch.SocketChannelImpl.checkConnect(Native Method)
    [junit] 	at sun.nio.ch.SocketChannelImpl.finishConnect(SocketChannelImpl.java:717)
    [junit] 	at org.apache.zookeeper.ClientCnxnSocketNIO.doTransport(ClientCnxnSocketNIO.java:357)
    [junit] 	at org.apache.zookeeper.ClientCnxn$SendThread.run(ClientCnxn.java:1214)

fail.build.on.test.failure:

BUILD FAILED
/home/jenkins/jenkins-slave/workspace/ZooKeeper-trunk-jdk8/build.xml:1258: The following error
occurred while executing this line:
/home/jenkins/jenkins-slave/workspace/ZooKeeper-trunk-jdk8/build.xml:1262: Tests failed!

Total time: 9 minutes 47 seconds
Build step 'Invoke Ant' marked build as failure
[WARNINGS] Skipping publisher since build result is FAILURE
Recording test results
Email was triggered for: Failure - Any
Sending email for trigger: Failure - Any



###################################################################################
############################## FAILED TESTS (if any) ##############################
1 tests failed.
FAILED:  org.apache.zookeeper.server.quorum.Zab1_0Test.testNormalFollowerRunWithDiff

Error Message:
expected:<4294967298> but was:<0>

Stack Trace:
junit.framework.AssertionFailedError: expected:<4294967298> but was:<0>
	at org.apache.zookeeper.server.quorum.Zab1_0Test$5.converseWithFollower(Zab1_0Test.java:869)
	at org.apache.zookeeper.server.quorum.Zab1_0Test.testFollowerConversation(Zab1_0Test.java:517)
	at org.apache.zookeeper.server.quorum.Zab1_0Test.testNormalFollowerRunWithDiff(Zab1_0Test.java:784)
	at org.apache.zookeeper.JUnit4ZKTestRunner$LoggedInvokeMethod.evaluate(JUnit4ZKTestRunner.java:79)
Mime
  • Unnamed multipart/mixed (inline, None, 0 bytes)
View raw message