zookeeper-dev mailing list archives

Site index · List index
Message view « Date » · « Thread »
Top « Date » · « Thread »
From Apache Jenkins Server <jenk...@builds.apache.org>
Subject ZooKeeper_branch35_jdk8 - Build # 716 - Still Failing
Date Sat, 14 Oct 2017 03:20:55 GMT
See https://builds.apache.org/job/ZooKeeper_branch35_jdk8/716/

###################################################################################
########################## LAST 60 LINES OF THE CONSOLE ###########################
[...truncated 70.46 MB...]
    [junit] 	at org.apache.zookeeper.ClientCnxnSocketNIO.doTransport(ClientCnxnSocketNIO.java:357)
    [junit] 	at org.apache.zookeeper.ClientCnxn$SendThread.run(ClientCnxn.java:1214)
    [junit] 2017-10-14 03:20:48,969 [myid:127.0.0.1:30076] - INFO  [main-SendThread(127.0.0.1:30076):ClientCnxn$SendThread@1113]
- Opening socket connection to server 127.0.0.1/127.0.0.1:30076. Will not attempt to authenticate
using SASL (unknown error)
    [junit] 2017-10-14 03:20:48,969 [myid:127.0.0.1:30076] - WARN  [main-SendThread(127.0.0.1:30076):ClientCnxn$SendThread@1235]
- Session 0x10742bc8ddc0000 for server 127.0.0.1/127.0.0.1:30076, unexpected error, closing
socket connection and attempting reconnect
    [junit] java.net.ConnectException: Connection refused
    [junit] 	at sun.nio.ch.SocketChannelImpl.checkConnect(Native Method)
    [junit] 	at sun.nio.ch.SocketChannelImpl.finishConnect(SocketChannelImpl.java:717)
    [junit] 	at org.apache.zookeeper.ClientCnxnSocketNIO.doTransport(ClientCnxnSocketNIO.java:357)
    [junit] 	at org.apache.zookeeper.ClientCnxn$SendThread.run(ClientCnxn.java:1214)
    [junit] 2017-10-14 03:20:49,206 [myid:127.0.0.1:30073] - INFO  [main-SendThread(127.0.0.1:30073):ClientCnxn$SendThread@1113]
- Opening socket connection to server 127.0.0.1/127.0.0.1:30073. Will not attempt to authenticate
using SASL (unknown error)
    [junit] 2017-10-14 03:20:49,207 [myid:127.0.0.1:30073] - WARN  [main-SendThread(127.0.0.1:30073):ClientCnxn$SendThread@1235]
- Session 0x742bc8c850000 for server 127.0.0.1/127.0.0.1:30073, unexpected error, closing
socket connection and attempting reconnect
    [junit] java.net.ConnectException: Connection refused
    [junit] 	at sun.nio.ch.SocketChannelImpl.checkConnect(Native Method)
    [junit] 	at sun.nio.ch.SocketChannelImpl.finishConnect(SocketChannelImpl.java:717)
    [junit] 	at org.apache.zookeeper.ClientCnxnSocketNIO.doTransport(ClientCnxnSocketNIO.java:357)
    [junit] 	at org.apache.zookeeper.ClientCnxn$SendThread.run(ClientCnxn.java:1214)
    [junit] 2017-10-14 03:20:50,244 [myid:127.0.0.1:30076] - INFO  [main-SendThread(127.0.0.1:30076):ClientCnxn$SendThread@1113]
- Opening socket connection to server 127.0.0.1/127.0.0.1:30076. Will not attempt to authenticate
using SASL (unknown error)
    [junit] 2017-10-14 03:20:50,245 [myid:127.0.0.1:30076] - WARN  [main-SendThread(127.0.0.1:30076):ClientCnxn$SendThread@1235]
- Session 0x10742bc8ddc0000 for server 127.0.0.1/127.0.0.1:30076, unexpected error, closing
socket connection and attempting reconnect
    [junit] java.net.ConnectException: Connection refused
    [junit] 	at sun.nio.ch.SocketChannelImpl.checkConnect(Native Method)
    [junit] 	at sun.nio.ch.SocketChannelImpl.finishConnect(SocketChannelImpl.java:717)
    [junit] 	at org.apache.zookeeper.ClientCnxnSocketNIO.doTransport(ClientCnxnSocketNIO.java:357)
    [junit] 	at org.apache.zookeeper.ClientCnxn$SendThread.run(ClientCnxn.java:1214)
    [junit] 2017-10-14 03:20:50,482 [myid:127.0.0.1:30076] - INFO  [main-SendThread(127.0.0.1:30076):ClientCnxn$SendThread@1113]
- Opening socket connection to server 127.0.0.1/127.0.0.1:30076. Will not attempt to authenticate
using SASL (unknown error)
    [junit] 2017-10-14 03:20:50,482 [myid:127.0.0.1:30076] - WARN  [main-SendThread(127.0.0.1:30076):ClientCnxn$SendThread@1235]
- Session 0x10742bc8ddc0001 for server 127.0.0.1/127.0.0.1:30076, unexpected error, closing
socket connection and attempting reconnect
    [junit] java.net.ConnectException: Connection refused
    [junit] 	at sun.nio.ch.SocketChannelImpl.checkConnect(Native Method)
    [junit] 	at sun.nio.ch.SocketChannelImpl.finishConnect(SocketChannelImpl.java:717)
    [junit] 	at org.apache.zookeeper.ClientCnxnSocketNIO.doTransport(ClientCnxnSocketNIO.java:357)
    [junit] 	at org.apache.zookeeper.ClientCnxn$SendThread.run(ClientCnxn.java:1214)
    [junit] 2017-10-14 03:20:50,578 [myid:127.0.0.1:30073] - INFO  [main-SendThread(127.0.0.1:30073):ClientCnxn$SendThread@1113]
- Opening socket connection to server 127.0.0.1/127.0.0.1:30073. Will not attempt to authenticate
using SASL (unknown error)
    [junit] 2017-10-14 03:20:50,579 [myid:127.0.0.1:30073] - WARN  [main-SendThread(127.0.0.1:30073):ClientCnxn$SendThread@1235]
- Session 0x742bc8c850000 for server 127.0.0.1/127.0.0.1:30073, unexpected error, closing
socket connection and attempting reconnect
    [junit] java.net.ConnectException: Connection refused
    [junit] 	at sun.nio.ch.SocketChannelImpl.checkConnect(Native Method)
    [junit] 	at sun.nio.ch.SocketChannelImpl.finishConnect(SocketChannelImpl.java:717)
    [junit] 	at org.apache.zookeeper.ClientCnxnSocketNIO.doTransport(ClientCnxnSocketNIO.java:357)
    [junit] 	at org.apache.zookeeper.ClientCnxn$SendThread.run(ClientCnxn.java:1214)
    [junit] 2017-10-14 03:20:50,584 [myid:127.0.0.1:30073] - INFO  [main-SendThread(127.0.0.1:30073):ClientCnxn$SendThread@1113]
- Opening socket connection to server 127.0.0.1/127.0.0.1:30073. Will not attempt to authenticate
using SASL (unknown error)
    [junit] 2017-10-14 03:20:50,585 [myid:127.0.0.1:30073] - WARN  [main-SendThread(127.0.0.1:30073):ClientCnxn$SendThread@1235]
- Session 0x742bc8c850001 for server 127.0.0.1/127.0.0.1:30073, unexpected error, closing
socket connection and attempting reconnect
    [junit] java.net.ConnectException: Connection refused
    [junit] 	at sun.nio.ch.SocketChannelImpl.checkConnect(Native Method)
    [junit] 	at sun.nio.ch.SocketChannelImpl.finishConnect(SocketChannelImpl.java:717)
    [junit] 	at org.apache.zookeeper.ClientCnxnSocketNIO.doTransport(ClientCnxnSocketNIO.java:357)
    [junit] 	at org.apache.zookeeper.ClientCnxn$SendThread.run(ClientCnxn.java:1214)
    [junit] Running org.apache.zookeeper.server.quorum.StandaloneDisabledTest in thread 8
    [junit] Tests run: 1, Failures: 0, Errors: 1, Skipped: 0, Time elapsed: 0 sec, Thread:
8, Class: org.apache.zookeeper.server.quorum.StandaloneDisabledTest
    [junit] Test org.apache.zookeeper.server.quorum.StandaloneDisabledTest FAILED (timeout)

fail.build.on.test.failure:

BUILD FAILED
/home/jenkins/jenkins-slave/workspace/ZooKeeper_branch35_jdk8/build.xml:1272: The following
error occurred while executing this line:
/home/jenkins/jenkins-slave/workspace/ZooKeeper_branch35_jdk8/build.xml:1276: Tests failed!

Total time: 16 minutes 9 seconds
Build step 'Invoke Ant' marked build as failure
Recording test results
Email was triggered for: Failure - Any
Sending email for trigger: Failure - Any



###################################################################################
############################## FAILED TESTS (if any) ##############################
1 tests failed.
FAILED:  org.apache.zookeeper.server.quorum.StandaloneDisabledTest.startSingleServerTest

Error Message:
Timeout occurred. Please note the time in the report does not reflect the time until the timeout.

Stack Trace:
junit.framework.AssertionFailedError: Timeout occurred. Please note the time in the report
does not reflect the time until the timeout.
	at java.lang.Thread.run(Thread.java:748)
Mime
  • Unnamed multipart/mixed (inline, None, 0 bytes)
View raw message