zookeeper-dev mailing list archives

Site index · List index
Message view « Date » · « Thread »
Top « Date » · « Thread »
From Apache Jenkins Server <jenk...@builds.apache.org>
Subject ZooKeeper_branch35_jdk8 - Build # 715 - Still Failing
Date Fri, 13 Oct 2017 12:09:57 GMT
See https://builds.apache.org/job/ZooKeeper_branch35_jdk8/715/

###################################################################################
########################## LAST 60 LINES OF THE CONSOLE ###########################
[...truncated 69.40 MB...]
    [junit] 2017-10-13 12:09:51,936 [myid:] - WARN  [New I/O boss #2772:ClientCnxnSocketNetty$ZKClientHandler@439]
- Exception caught: [id: 0xcd8f86c6] EXCEPTION: java.net.ConnectException: Connection refused:
127.0.0.1/127.0.0.1:16734
    [junit] java.net.ConnectException: Connection refused: 127.0.0.1/127.0.0.1:16734
    [junit] 	at sun.nio.ch.SocketChannelImpl.checkConnect(Native Method)
    [junit] 	at sun.nio.ch.SocketChannelImpl.finishConnect(SocketChannelImpl.java:717)
    [junit] 	at org.jboss.netty.channel.socket.nio.NioClientBoss.connect(NioClientBoss.java:152)
    [junit] 	at org.jboss.netty.channel.socket.nio.NioClientBoss.processSelectedKeys(NioClientBoss.java:105)
    [junit] 	at org.jboss.netty.channel.socket.nio.NioClientBoss.process(NioClientBoss.java:79)
    [junit] 	at org.jboss.netty.channel.socket.nio.AbstractNioSelector.run(AbstractNioSelector.java:337)
    [junit] 	at org.jboss.netty.channel.socket.nio.NioClientBoss.run(NioClientBoss.java:42)
    [junit] 	at org.jboss.netty.util.ThreadRenamingRunnable.run(ThreadRenamingRunnable.java:108)
    [junit] 	at org.jboss.netty.util.internal.DeadLockProofWorker$1.run(DeadLockProofWorker.java:42)
    [junit] 	at java.util.concurrent.ThreadPoolExecutor.runWorker(ThreadPoolExecutor.java:1149)
    [junit] 	at java.util.concurrent.ThreadPoolExecutor$Worker.run(ThreadPoolExecutor.java:624)
    [junit] 	at java.lang.Thread.run(Thread.java:748)
    [junit] 2017-10-13 12:09:51,936 [myid:] - INFO  [New I/O boss #2772:ClientCnxnSocketNetty@208]
- channel is told closing
    [junit] 2017-10-13 12:09:51,936 [myid:127.0.0.1:16734] - INFO  [main-SendThread(127.0.0.1:16734):ClientCnxn$SendThread@1231]
- channel for sessionid 0x2085b7851b00000 is lost, closing socket connection and attempting
reconnect
    [junit] 2017-10-13 12:09:52,119 [myid:127.0.0.1:16737] - INFO  [main-SendThread(127.0.0.1:16737):ClientCnxn$SendThread@1113]
- Opening socket connection to server 127.0.0.1/127.0.0.1:16737. Will not attempt to authenticate
using SASL (unknown error)
    [junit] 2017-10-13 12:09:52,121 [myid:] - INFO  [New I/O boss #2781:ClientCnxnSocketNetty$1@127]
- future isn't success, cause: {}
    [junit] java.net.ConnectException: Connection refused: 127.0.0.1/127.0.0.1:16737
    [junit] 	at sun.nio.ch.SocketChannelImpl.checkConnect(Native Method)
    [junit] 	at sun.nio.ch.SocketChannelImpl.finishConnect(SocketChannelImpl.java:717)
    [junit] 	at org.jboss.netty.channel.socket.nio.NioClientBoss.connect(NioClientBoss.java:152)
    [junit] 	at org.jboss.netty.channel.socket.nio.NioClientBoss.processSelectedKeys(NioClientBoss.java:105)
    [junit] 	at org.jboss.netty.channel.socket.nio.NioClientBoss.process(NioClientBoss.java:79)
    [junit] 	at org.jboss.netty.channel.socket.nio.AbstractNioSelector.run(AbstractNioSelector.java:337)
    [junit] 	at org.jboss.netty.channel.socket.nio.NioClientBoss.run(NioClientBoss.java:42)
    [junit] 	at org.jboss.netty.util.ThreadRenamingRunnable.run(ThreadRenamingRunnable.java:108)
    [junit] 	at org.jboss.netty.util.internal.DeadLockProofWorker$1.run(DeadLockProofWorker.java:42)
    [junit] 	at java.util.concurrent.ThreadPoolExecutor.runWorker(ThreadPoolExecutor.java:1149)
    [junit] 	at java.util.concurrent.ThreadPoolExecutor$Worker.run(ThreadPoolExecutor.java:624)
    [junit] 	at java.lang.Thread.run(Thread.java:748)
    [junit] 2017-10-13 12:09:52,121 [myid:] - WARN  [New I/O boss #2781:ClientCnxnSocketNetty$ZKClientHandler@439]
- Exception caught: [id: 0xd1106a2a] EXCEPTION: java.net.ConnectException: Connection refused:
127.0.0.1/127.0.0.1:16737
    [junit] java.net.ConnectException: Connection refused: 127.0.0.1/127.0.0.1:16737
    [junit] 	at sun.nio.ch.SocketChannelImpl.checkConnect(Native Method)
    [junit] 	at sun.nio.ch.SocketChannelImpl.finishConnect(SocketChannelImpl.java:717)
    [junit] 	at org.jboss.netty.channel.socket.nio.NioClientBoss.connect(NioClientBoss.java:152)
    [junit] 	at org.jboss.netty.channel.socket.nio.NioClientBoss.processSelectedKeys(NioClientBoss.java:105)
    [junit] 	at org.jboss.netty.channel.socket.nio.NioClientBoss.process(NioClientBoss.java:79)
    [junit] 	at org.jboss.netty.channel.socket.nio.AbstractNioSelector.run(AbstractNioSelector.java:337)
    [junit] 	at org.jboss.netty.channel.socket.nio.NioClientBoss.run(NioClientBoss.java:42)
    [junit] 	at org.jboss.netty.util.ThreadRenamingRunnable.run(ThreadRenamingRunnable.java:108)
    [junit] 	at org.jboss.netty.util.internal.DeadLockProofWorker$1.run(DeadLockProofWorker.java:42)
    [junit] 	at java.util.concurrent.ThreadPoolExecutor.runWorker(ThreadPoolExecutor.java:1149)
    [junit] 	at java.util.concurrent.ThreadPoolExecutor$Worker.run(ThreadPoolExecutor.java:624)
    [junit] 	at java.lang.Thread.run(Thread.java:748)
    [junit] 2017-10-13 12:09:52,121 [myid:] - INFO  [New I/O boss #2781:ClientCnxnSocketNetty@208]
- channel is told closing
    [junit] 2017-10-13 12:09:52,121 [myid:127.0.0.1:16737] - INFO  [main-SendThread(127.0.0.1:16737):ClientCnxn$SendThread@1231]
- channel for sessionid 0x3085b7851920000 is lost, closing socket connection and attempting
reconnect

fail.build.on.test.failure:

BUILD FAILED
/home/jenkins/jenkins-slave/workspace/ZooKeeper_branch35_jdk8/build.xml:1272: The following
error occurred while executing this line:
/home/jenkins/jenkins-slave/workspace/ZooKeeper_branch35_jdk8/build.xml:1276: Tests failed!

Total time: 14 minutes 57 seconds
Build step 'Invoke Ant' marked build as failure
Recording test results
Email was triggered for: Failure - Any
Sending email for trigger: Failure - Any



###################################################################################
############################## FAILED TESTS (if any) ##############################
2 tests failed.
FAILED:  org.apache.zookeeper.server.quorum.Zab1_0Test.testNormalFollowerRunWithDiff

Error Message:
expected:<4294967298> but was:<0>

Stack Trace:
junit.framework.AssertionFailedError: expected:<4294967298> but was:<0>
	at org.apache.zookeeper.server.quorum.Zab1_0Test$5.converseWithFollower(Zab1_0Test.java:875)
	at org.apache.zookeeper.server.quorum.Zab1_0Test.testFollowerConversation(Zab1_0Test.java:522)
	at org.apache.zookeeper.server.quorum.Zab1_0Test.testNormalFollowerRunWithDiff(Zab1_0Test.java:790)
	at org.apache.zookeeper.JUnit4ZKTestRunner$LoggedInvokeMethod.evaluate(JUnit4ZKTestRunner.java:79)


FAILED:  org.apache.zookeeper.test.FLETest.testTripleElection

Error Message:
Leader hasn't joined: -1

Stack Trace:
junit.framework.AssertionFailedError: Leader hasn't joined: -1
	at org.apache.zookeeper.test.FLETest.runElection(FLETest.java:368)
	at org.apache.zookeeper.test.FLETest.testTripleElection(FLETest.java:286)
	at org.apache.zookeeper.JUnit4ZKTestRunner$LoggedInvokeMethod.evaluate(JUnit4ZKTestRunner.java:79)
Mime
  • Unnamed multipart/mixed (inline, None, 0 bytes)
View raw message