zookeeper-dev mailing list archives

Site index · List index
Message view « Date » · « Thread »
Top « Date » · « Thread »
From Apache Jenkins Server <jenk...@builds.apache.org>
Subject ZooKeeper_branch35_jdk7 - Build # 1160 - Still Failing
Date Thu, 19 Oct 2017 08:50:55 GMT
See https://builds.apache.org/job/ZooKeeper_branch35_jdk7/1160/

###################################################################################
########################## LAST 60 LINES OF THE CONSOLE ###########################
[...truncated 60.87 MB...]
    [junit] 2017-10-19 08:50:52,088 [myid:127.0.0.1:16608] - INFO  [main-SendThread(127.0.0.1:16608):ClientCnxn$SendThread@1113]
- Opening socket connection to server 127.0.0.1/127.0.0.1:16608. Will not attempt to authenticate
using SASL (unknown error)
    [junit] 2017-10-19 08:50:52,089 [myid:127.0.0.1:16608] - WARN  [main-SendThread(127.0.0.1:16608):ClientCnxn$SendThread@1235]
- Session 0x1075e6cd4910000 for server 127.0.0.1/127.0.0.1:16608, unexpected error, closing
socket connection and attempting reconnect
    [junit] java.net.ConnectException: Connection refused
    [junit] 	at sun.nio.ch.SocketChannelImpl.checkConnect(Native Method)
    [junit] 	at sun.nio.ch.SocketChannelImpl.finishConnect(SocketChannelImpl.java:744)
    [junit] 	at org.apache.zookeeper.ClientCnxnSocketNIO.doTransport(ClientCnxnSocketNIO.java:357)
    [junit] 	at org.apache.zookeeper.ClientCnxn$SendThread.run(ClientCnxn.java:1214)
    [junit] 2017-10-19 08:50:52,228 [myid:127.0.0.1:16734] - INFO  [main-SendThread(127.0.0.1:16734):ClientCnxn$SendThread@1113]
- Opening socket connection to server 127.0.0.1/127.0.0.1:16734. Will not attempt to authenticate
using SASL (unknown error)
    [junit] 2017-10-19 08:50:52,229 [myid:127.0.0.1:16734] - WARN  [main-SendThread(127.0.0.1:16734):ClientCnxn$SendThread@1235]
- Session 0x2075e6fe2110000 for server 127.0.0.1/127.0.0.1:16734, unexpected error, closing
socket connection and attempting reconnect
    [junit] java.net.ConnectException: Connection refused
    [junit] 	at sun.nio.ch.SocketChannelImpl.checkConnect(Native Method)
    [junit] 	at sun.nio.ch.SocketChannelImpl.finishConnect(SocketChannelImpl.java:744)
    [junit] 	at org.apache.zookeeper.ClientCnxnSocketNIO.doTransport(ClientCnxnSocketNIO.java:357)
    [junit] 	at org.apache.zookeeper.ClientCnxn$SendThread.run(ClientCnxn.java:1214)
    [junit] 2017-10-19 08:50:52,316 [myid:] - INFO  [ProcessThread(sid:0 cport:16854)::PrepRequestProcessor@611]
- Processed session termination for sessionid: 0x1075e7325060000
    [junit] 2017-10-19 08:50:52,317 [myid:] - INFO  [SyncThread:0:MBeanRegistry@128] - Unregister
MBean [org.apache.ZooKeeperService:name0=StandaloneServer_port16854,name1=Connections,name2=127.0.0.1,name3=0x1075e7325060000]
    [junit] 2017-10-19 08:50:52,318 [myid:] - INFO  [main:ZooKeeper@1334] - Session: 0x1075e7325060000
closed
    [junit] 2017-10-19 08:50:52,318 [myid:] - INFO  [main-EventThread:ClientCnxn$EventThread@513]
- EventThread shut down for session: 0x1075e7325060000
    [junit] 2017-10-19 08:50:52,318 [myid:] - INFO  [main:JUnit4ZKTestRunner$LoggedInvokeMethod@82]
- Memory used 199780
    [junit] 2017-10-19 08:50:52,318 [myid:] - INFO  [main:JUnit4ZKTestRunner$LoggedInvokeMethod@87]
- Number of threads 2432
    [junit] 2017-10-19 08:50:52,318 [myid:] - INFO  [main:JUnit4ZKTestRunner$LoggedInvokeMethod@102]
- FINISHED TEST METHOD testWatcherAutoResetWithLocal
    [junit] 2017-10-19 08:50:52,319 [myid:] - INFO  [main:ClientBase@586] - tearDown starting
    [junit] 2017-10-19 08:50:52,319 [myid:] - INFO  [main:ClientBase@556] - STOPPING server
    [junit] 2017-10-19 08:50:52,319 [myid:] - INFO  [main:NettyServerCnxnFactory@464] - shutdown
called 0.0.0.0/0.0.0.0:16854
    [junit] 2017-10-19 08:50:52,326 [myid:] - INFO  [main:ZooKeeperServer@541] - shutting
down
    [junit] 2017-10-19 08:50:52,327 [myid:] - ERROR [main:ZooKeeperServer@505] - ZKShutdownHandler
is not registered, so ZooKeeper server won't take any action on ERROR or SHUTDOWN server state
changes
    [junit] 2017-10-19 08:50:52,327 [myid:] - INFO  [main:SessionTrackerImpl@232] - Shutting
down
    [junit] 2017-10-19 08:50:52,327 [myid:] - INFO  [main:PrepRequestProcessor@1005] - Shutting
down
    [junit] 2017-10-19 08:50:52,327 [myid:] - INFO  [main:SyncRequestProcessor@191] - Shutting
down
    [junit] 2017-10-19 08:50:52,327 [myid:] - INFO  [ProcessThread(sid:0 cport:16854)::PrepRequestProcessor@155]
- PrepRequestProcessor exited loop!
    [junit] 2017-10-19 08:50:52,328 [myid:] - INFO  [SyncThread:0:SyncRequestProcessor@169]
- SyncRequestProcessor exited!
    [junit] 2017-10-19 08:50:52,328 [myid:] - INFO  [main:FinalRequestProcessor@481] - shutdown
of request processor complete
    [junit] 2017-10-19 08:50:52,328 [myid:] - INFO  [main:MBeanRegistry@128] - Unregister
MBean [org.apache.ZooKeeperService:name0=StandaloneServer_port16854,name1=InMemoryDataTree]
    [junit] 2017-10-19 08:50:52,329 [myid:] - INFO  [main:MBeanRegistry@128] - Unregister
MBean [org.apache.ZooKeeperService:name0=StandaloneServer_port16854]
    [junit] 2017-10-19 08:50:52,329 [myid:] - INFO  [main:FourLetterWordMain@87] - connecting
to 127.0.0.1 16854
    [junit] 2017-10-19 08:50:52,330 [myid:] - INFO  [main:JMXEnv@146] - ensureOnly:[]
    [junit] 2017-10-19 08:50:52,341 [myid:] - INFO  [main:ClientBase@611] - fdcount after
test is: 7166 at start it was 7166
    [junit] 2017-10-19 08:50:52,341 [myid:] - INFO  [main:ZKTestCase$1@68] - SUCCEEDED testWatcherAutoResetWithLocal
    [junit] 2017-10-19 08:50:52,342 [myid:] - INFO  [main:ZKTestCase$1@63] - FINISHED testWatcherAutoResetWithLocal
    [junit] Tests run: 103, Failures: 0, Errors: 0, Skipped: 0, Time elapsed: 427.823 sec,
Thread: 3, Class: org.apache.zookeeper.test.NioNettySuiteTest
    [junit] 2017-10-19 08:50:52,378 [myid:127.0.0.1:16657] - INFO  [main-SendThread(127.0.0.1:16657):ClientCnxn$SendThread@1113]
- Opening socket connection to server 127.0.0.1/127.0.0.1:16657. Will not attempt to authenticate
using SASL (unknown error)
    [junit] 2017-10-19 08:50:52,379 [myid:127.0.0.1:16657] - WARN  [main-SendThread(127.0.0.1:16657):ClientCnxn$SendThread@1235]
- Session 0x1075e6d418d0001 for server 127.0.0.1/127.0.0.1:16657, unexpected error, closing
socket connection and attempting reconnect
    [junit] java.net.ConnectException: Connection refused
    [junit] 	at sun.nio.ch.SocketChannelImpl.checkConnect(Native Method)
    [junit] 	at sun.nio.ch.SocketChannelImpl.finishConnect(SocketChannelImpl.java:744)
    [junit] 	at org.apache.zookeeper.ClientCnxnSocketNIO.doTransport(ClientCnxnSocketNIO.java:357)
    [junit] 	at org.apache.zookeeper.ClientCnxn$SendThread.run(ClientCnxn.java:1214)

fail.build.on.test.failure:

BUILD FAILED
/home/jenkins/jenkins-slave/workspace/ZooKeeper_branch35_jdk7/build.xml:1272: The following
error occurred while executing this line:
/home/jenkins/jenkins-slave/workspace/ZooKeeper_branch35_jdk7/build.xml:1276: Tests failed!

Total time: 11 minutes 14 seconds
Build step 'Invoke Ant' marked build as failure
Recording test results
Email was triggered for: Failure - Any
Sending email for trigger: Failure - Any



###################################################################################
############################## FAILED TESTS (if any) ##############################
1 tests failed.
FAILED:  org.apache.zookeeper.test.FourLetterWordsWhiteListTest.testFourLetterWordsAllDisabledByDefault

Error Message:
Exception while executing four letter word: srvr

Stack Trace:
java.io.IOException: Exception while executing four letter word: srvr
	at org.apache.zookeeper.client.FourLetterWordMain.send4LetterWord(FourLetterWordMain.java:126)
	at org.apache.zookeeper.client.FourLetterWordMain.send4LetterWord(FourLetterWordMain.java:56)
	at org.apache.zookeeper.test.FourLetterWordsWhiteListTest.sendRequest(FourLetterWordsWhiteListTest.java:233)
	at org.apache.zookeeper.test.FourLetterWordsWhiteListTest.verifyFuzzyMatch(FourLetterWordsWhiteListTest.java:237)
	at org.apache.zookeeper.test.FourLetterWordsWhiteListTest.verifyAllCommandsFail(FourLetterWordsWhiteListTest.java:228)
	at org.apache.zookeeper.test.FourLetterWordsWhiteListTest.testFourLetterWordsAllDisabledByDefault(FourLetterWordsWhiteListTest.java:56)
	at org.apache.zookeeper.JUnit4ZKTestRunner$LoggedInvokeMethod.evaluate(JUnit4ZKTestRunner.java:79)
	at java.util.concurrent.FutureTask.run(FutureTask.java:262)
	at java.lang.Thread.run(Thread.java:745)
Caused by: java.net.SocketTimeoutException: Read timed out
	at java.net.SocketInputStream.socketRead0(Native Method)
	at java.net.SocketInputStream.read(SocketInputStream.java:152)
	at java.net.SocketInputStream.read(SocketInputStream.java:122)
	at sun.nio.cs.StreamDecoder.readBytes(StreamDecoder.java:283)
	at sun.nio.cs.StreamDecoder.implRead(StreamDecoder.java:325)
	at sun.nio.cs.StreamDecoder.read(StreamDecoder.java:177)
	at java.io.InputStreamReader.read(InputStreamReader.java:184)
	at java.io.BufferedReader.fill(BufferedReader.java:154)
	at java.io.BufferedReader.readLine(BufferedReader.java:317)
	at java.io.BufferedReader.readLine(BufferedReader.java:382)
	at org.apache.zookeeper.client.FourLetterWordMain.send4LetterWord(FourLetterWordMain.java:121)
Mime
  • Unnamed multipart/mixed (inline, None, 0 bytes)
View raw message