zookeeper-dev mailing list archives

Site index · List index
Message view « Date » · « Thread »
Top « Date » · « Thread »
From Apache Jenkins Server <jenk...@builds.apache.org>
Subject ZooKeeper-trunk-openjdk7 - Build # 1660 - Still Failing
Date Wed, 11 Oct 2017 14:30:44 GMT
See https://builds.apache.org/job/ZooKeeper-trunk-openjdk7/1660/

###################################################################################
########################## LAST 60 LINES OF THE CONSOLE ###########################
[...truncated 64.59 MB...]
    [junit] 2017-10-11 14:24:47,303 [myid:] - INFO  [main:ZooKeeper@1332] - Session: 0x103facf1fa90000
closed
    [junit] 2017-10-11 14:24:47,303 [myid:] - INFO  [main-EventThread:ClientCnxn$EventThread@513]
- EventThread shut down for session: 0x103facf1fa90000
    [junit] 2017-10-11 14:24:47,304 [myid:127.0.0.1:13915] - WARN  [main-SendThread(127.0.0.1:13915):ClientCnxn$SendThread@1235]
- Session 0x103fac905280000 for server 127.0.0.1/127.0.0.1:13915, unexpected error, closing
socket connection and attempting reconnect
    [junit] java.net.ConnectException: Connection refused
    [junit] 	at sun.nio.ch.SocketChannelImpl.checkConnect(Native Method)
    [junit] 	at sun.nio.ch.SocketChannelImpl.finishConnect(SocketChannelImpl.java:744)
    [junit] 	at org.apache.zookeeper.ClientCnxnSocketNIO.doTransport(ClientCnxnSocketNIO.java:357)
    [junit] 	at org.apache.zookeeper.ClientCnxn$SendThread.run(ClientCnxn.java:1214)
    [junit] 2017-10-11 14:24:47,304 [myid:] - INFO  [main:JUnit4ZKTestRunner$LoggedInvokeMethod@82]
- Memory used 149172
    [junit] 2017-10-11 14:24:47,304 [myid:] - INFO  [main:JUnit4ZKTestRunner$LoggedInvokeMethod@87]
- Number of threads 471
    [junit] 2017-10-11 14:24:47,304 [myid:] - INFO  [main:JUnit4ZKTestRunner$LoggedInvokeMethod@102]
- FINISHED TEST METHOD testWatcherAutoResetWithLocal
    [junit] 2017-10-11 14:24:47,305 [myid:] - INFO  [main:ClientBase@601] - tearDown starting
    [junit] 2017-10-11 14:24:47,305 [myid:] - INFO  [main:ClientBase@571] - STOPPING server
    [junit] 2017-10-11 14:24:47,305 [myid:] - INFO  [main:NettyServerCnxnFactory@464] - shutdown
called 0.0.0.0/0.0.0.0:14161
    [junit] 2017-10-11 14:24:47,307 [myid:] - INFO  [main:ZooKeeperServer@545] - shutting
down
    [junit] 2017-10-11 14:24:47,307 [myid:] - ERROR [main:ZooKeeperServer@509] - ZKShutdownHandler
is not registered, so ZooKeeper server won't take any action on ERROR or SHUTDOWN server state
changes
    [junit] 2017-10-11 14:24:47,307 [myid:] - INFO  [main:SessionTrackerImpl@232] - Shutting
down
    [junit] 2017-10-11 14:24:47,307 [myid:] - INFO  [main:PrepRequestProcessor@1010] - Shutting
down
    [junit] 2017-10-11 14:24:47,307 [myid:] - INFO  [main:SyncRequestProcessor@191] - Shutting
down
    [junit] 2017-10-11 14:24:47,307 [myid:] - INFO  [ProcessThread(sid:0 cport:14161)::PrepRequestProcessor@155]
- PrepRequestProcessor exited loop!
    [junit] 2017-10-11 14:24:47,308 [myid:] - INFO  [SyncThread:0:SyncRequestProcessor@169]
- SyncRequestProcessor exited!
    [junit] 2017-10-11 14:24:47,308 [myid:] - INFO  [main:FinalRequestProcessor@481] - shutdown
of request processor complete
    [junit] 2017-10-11 14:24:47,308 [myid:] - INFO  [main:MBeanRegistry@128] - Unregister
MBean [org.apache.ZooKeeperService:name0=StandaloneServer_port14161,name1=InMemoryDataTree]
    [junit] 2017-10-11 14:24:47,309 [myid:] - INFO  [main:MBeanRegistry@128] - Unregister
MBean [org.apache.ZooKeeperService:name0=StandaloneServer_port14161]
    [junit] 2017-10-11 14:24:47,309 [myid:] - INFO  [main:FourLetterWordMain@87] - connecting
to 127.0.0.1 14161
    [junit] 2017-10-11 14:24:47,309 [myid:] - INFO  [main:JMXEnv@146] - ensureOnly:[]
    [junit] 2017-10-11 14:24:47,315 [myid:] - INFO  [main:ClientBase@626] - fdcount after
test is: 1411 at start it was 1411
    [junit] 2017-10-11 14:24:47,315 [myid:] - INFO  [main:ZKTestCase$1@68] - SUCCEEDED testWatcherAutoResetWithLocal
    [junit] 2017-10-11 14:24:47,315 [myid:] - INFO  [main:ZKTestCase$1@63] - FINISHED testWatcherAutoResetWithLocal
    [junit] Tests run: 105, Failures: 0, Errors: 0, Skipped: 0, Time elapsed: 407.429 sec,
Thread: 2, Class: org.apache.zookeeper.test.NioNettySuiteTest
    [junit] 2017-10-11 14:24:47,680 [myid:127.0.0.1:14041] - INFO  [main-SendThread(127.0.0.1:14041):ClientCnxn$SendThread@1113]
- Opening socket connection to server 127.0.0.1/127.0.0.1:14041. Will not attempt to authenticate
using SASL (unknown error)
    [junit] 2017-10-11 14:24:47,681 [myid:127.0.0.1:14041] - WARN  [main-SendThread(127.0.0.1:14041):ClientCnxn$SendThread@1235]
- Session 0x203facbcd460000 for server 127.0.0.1/127.0.0.1:14041, unexpected error, closing
socket connection and attempting reconnect
    [junit] java.net.ConnectException: Connection refused
    [junit] 	at sun.nio.ch.SocketChannelImpl.checkConnect(Native Method)
    [junit] 	at sun.nio.ch.SocketChannelImpl.finishConnect(SocketChannelImpl.java:744)
    [junit] 	at org.apache.zookeeper.ClientCnxnSocketNIO.doTransport(ClientCnxnSocketNIO.java:357)
    [junit] 	at org.apache.zookeeper.ClientCnxn$SendThread.run(ClientCnxn.java:1214)
    [junit] 2017-10-11 14:24:47,862 [myid:127.0.0.1:13979] - INFO  [main-SendThread(127.0.0.1:13979):ClientCnxn$SendThread@1113]
- Opening socket connection to server 127.0.0.1/127.0.0.1:13979. Will not attempt to authenticate
using SASL (unknown error)
    [junit] 2017-10-11 14:24:47,862 [myid:127.0.0.1:13979] - WARN  [main-SendThread(127.0.0.1:13979):ClientCnxn$SendThread@1235]
- Session 0x103fac9ab220000 for server 127.0.0.1/127.0.0.1:13979, unexpected error, closing
socket connection and attempting reconnect
    [junit] java.net.ConnectException: Connection refused
    [junit] 	at sun.nio.ch.SocketChannelImpl.checkConnect(Native Method)
    [junit] 	at sun.nio.ch.SocketChannelImpl.finishConnect(SocketChannelImpl.java:744)
    [junit] 	at org.apache.zookeeper.ClientCnxnSocketNIO.doTransport(ClientCnxnSocketNIO.java:357)
    [junit] 	at org.apache.zookeeper.ClientCnxn$SendThread.run(ClientCnxn.java:1214)
    [junit] Running org.apache.zookeeper.server.quorum.Zab1_0Test in thread 1
    [junit] Tests run: 1, Failures: 0, Errors: 1, Skipped: 0, Time elapsed: 0 sec, Thread:
1, Class: org.apache.zookeeper.server.quorum.Zab1_0Test
    [junit] Test org.apache.zookeeper.server.quorum.Zab1_0Test FAILED (timeout)

fail.build.on.test.failure:

BUILD FAILED
/home/jenkins/jenkins-slave/workspace/ZooKeeper-trunk-openjdk7/build.xml:1263: The following
error occurred while executing this line:
/home/jenkins/jenkins-slave/workspace/ZooKeeper-trunk-openjdk7/build.xml:1267: Tests failed!

Total time: 16 minutes 58 seconds
Build step 'Invoke Ant' marked build as failure
Recording test results
Email was triggered for: Failure - Any
Sending email for trigger: Failure - Any



###################################################################################
############################## FAILED TESTS (if any) ##############################
2 tests failed.
FAILED:  org.apache.zookeeper.server.quorum.Zab1_0Test.testNormalObserverRun

Error Message:
Timeout occurred. Please note the time in the report does not reflect the time until the timeout.

Stack Trace:
junit.framework.AssertionFailedError: Timeout occurred. Please note the time in the report
does not reflect the time until the timeout.
	at java.lang.Thread.run(Thread.java:748)


FAILED:  org.apache.zookeeper.test.WatchEventWhenAutoResetTest.testNodeDataChanged

Error Message:
expected:<NodeDataChanged> but was:<NodeDeleted>

Stack Trace:
junit.framework.AssertionFailedError: expected:<NodeDataChanged> but was:<NodeDeleted>
	at org.apache.zookeeper.test.WatchEventWhenAutoResetTest$EventsWatcher.assertEvent(WatchEventWhenAutoResetTest.java:67)
	at org.apache.zookeeper.test.WatchEventWhenAutoResetTest.testNodeDataChanged(WatchEventWhenAutoResetTest.java:117)
	at org.apache.zookeeper.JUnit4ZKTestRunner$LoggedInvokeMethod.evaluate(JUnit4ZKTestRunner.java:79)
Mime
  • Unnamed multipart/mixed (inline, None, 0 bytes)
View raw message