zookeeper-dev mailing list archives

Site index · List index
Message view « Date » · « Thread »
Top « Date » · « Thread »
From Patrick Hunt <ph...@apache.org>
Subject Re: More Jenkins problems
Date Tue, 26 Sep 2017 14:37:18 GMT
That's really odd. I wonder if one of the environments has a bad .ant
cache? I kicked off a new build and didn't see the same issue:
https://builds.apache.org/job/PreCommit-ZOOKEEPER-github-pr-build/1042/console

Patrick

On Mon, Sep 25, 2017 at 9:29 AM, Jordan Zimmerman <
jordan@jordanzimmerman.com> wrote:

> https://builds.apache.org/job/PreCommit-ZOOKEEPER-github-pr-
> build/1040/console <https://builds.apache.org/job/PreCommit-ZOOKEEPER-
> github-pr-build/1040/console>
>
> There's some kind of ivy exception here.
>
>
>  [exec] BUILD FAILED
>      [exec] /home/jenkins/jenkins-slave/workspace/PreCommit-ZOOKEEPER-github-pr-build/build.xml:373:
> impossible to ivy retrieve: java.lang.RuntimeException: problem during
> retrieve of org.apache.zookeeper#zookeeper: java.text.ParseException:
> failed to parse report: /home/jenkins/.ant/cache/org.
> apache.zookeeper-zookeeper-default.xml: The markup in the document
> following the root element must be well-formed.
>      [exec]     at org.apache.ivy.core.retrieve.RetrieveEngine.retrieve(
> RetrieveEngine.java:249)
>      [exec]     at org.apache.ivy.Ivy.retrieve(Ivy.java:561)
>      [exec]     at org.apache.ivy.ant.IvyRetrieve.doExecute(
> IvyRetrieve.java:98)
>      [exec]     at org.apache.ivy.ant.IvyTask.execute(IvyTask.java:271)
>      [exec]     at org.apache.tools.ant.UnknownElement.execute(
> UnknownElement.java:293)
>      [exec]     at sun.reflect.GeneratedMethodAccessor4.invoke(Unknown
> Source)
>      [exec]     at sun.reflect.DelegatingMethodAccessorImpl.invoke(
> DelegatingMethodAccessorImpl.java:43)
>      [exec]     at java.lang.reflect.Method.invoke(Method.java:606)
>      [exec]     at org.apache.tools.ant.dispatch.DispatchUtils.execute(
> DispatchUtils.java:106)
>      [exec]     at org.apache.tools.ant.Task.perform(Task.java:348)
>      [exec]     at org.apache.tools.ant.Target.execute(Target.java:435)
>      [exec]     at org.apache.tools.ant.Target.
> performTasks(Target.java:456)
>      [exec]     at org.apache.tools.ant.Project.
> executeSortedTargets(Project.java:1405)
>      [exec]     at org.apache.tools.ant.Project.
> executeTarget(Project.java:1376)
>      [exec]     at org.apache.tools.ant.helper.DefaultExecutor.
> executeTargets(DefaultExecutor.java:41)
>      [exec]     at org.apache.tools.ant.Project.
> executeTargets(Project.java:1260)
>      [exec]     at org.apache.tools.ant.Main.runBuild(Main.java:857)
>      [exec]     at org.apache.tools.ant.Main.startAnt(Main.java:236)
>      [exec]     at org.apache.tools.ant.launch.Launcher.run(Launcher.java:
> 287)
>      [exec]     at org.apache.tools.ant.launch.
> Launcher.main(Launcher.java:113)
>      [exec] Caused by: java.text.ParseException: failed to parse report:
> /home/jenkins/.ant/cache/org.apache.zookeeper-zookeeper-default.xml: The
> markup in the
>
>

Mime
  • Unnamed multipart/alternative (inline, None, 0 bytes)
View raw message