zookeeper-dev mailing list archives

Site index · List index
Message view « Date » · « Thread »
Top « Date » · « Thread »
From Apache Jenkins Server <jenk...@builds.apache.org>
Subject ZooKeeper_branch34 - Build # 2079 - Failure
Date Wed, 13 Sep 2017 00:24:14 GMT
See https://builds.apache.org/job/ZooKeeper_branch34/2079/

###################################################################################
########################## LAST 60 LINES OF THE CONSOLE ###########################
[...truncated 31.94 MB...]
     [exec] Zookeeper_watchers::testChildWatcher1 : elapsed 300 : OK
     [exec] Zookeeper_watchers::testChildWatcher2 : elapsed 300 : OK
     [exec] OK (35)
     [exec] ./zktest-mt 
     [exec]  ZooKeeper server started
     [exec] Running 
     [exec] Zookeeper_clientretry::testRetry ZooKeeper server started ZooKeeper server started
: elapsed 9120 : OK
     [exec] Zookeeper_operations::testAsyncWatcher1 : elapsed 54 : OK
     [exec] Zookeeper_operations::testAsyncGetOperation : elapsed 5 : OK
     [exec] Zookeeper_operations::testOperationsAndDisconnectConcurrently1 : elapsed 381 :
OK
     [exec] Zookeeper_operations::testOperationsAndDisconnectConcurrently2 : elapsed 0 : OK
     [exec] Zookeeper_operations::testConcurrentOperations1 : elapsed 3890 : OK
     [exec] Zookeeper_init::testBasic : elapsed 0 : OK
     [exec] Zookeeper_init::testAddressResolution : elapsed 0 : OK
     [exec] Zookeeper_init::testMultipleAddressResolution : elapsed 0 : OK
     [exec] Zookeeper_init::testNullAddressString : elapsed 0 : OK
     [exec] Zookeeper_init::testEmptyAddressString : elapsed 0 : OK
     [exec] Zookeeper_init::testOneSpaceAddressString : elapsed 0 : OK
     [exec] Zookeeper_init::testTwoSpacesAddressString : elapsed 0 : OK
     [exec] Zookeeper_init::testInvalidAddressString1 : elapsed 0 : OK
     [exec] Zookeeper_init::testInvalidAddressString2 : elapsed 131 : OK
     [exec] Zookeeper_init::testNonexistentHost : elapsed 12 : OK
     [exec] Zookeeper_init::testOutOfMemory_init : elapsed 0 : OK
     [exec] Zookeeper_init::testOutOfMemory_getaddrs1 : elapsed 0 : OK
     [exec] Zookeeper_init::testOutOfMemory_getaddrs2 : elapsed 0 : OK
     [exec] Zookeeper_init::testPermuteAddrsList : elapsed 0 : OK
     [exec] Zookeeper_close::testIOThreadStoppedOnExpire : elapsed 262 : OK
     [exec] Zookeeper_close::testCloseUnconnected : elapsed 0 : OK
     [exec] Zookeeper_close::testCloseUnconnected1 : elapsed 48 : OK
     [exec] Zookeeper_close::testCloseConnected1 : elapsed 241 : OK
     [exec] Zookeeper_close::testCloseFromWatcher1 : elapsed 261 : OK
     [exec] Zookeeper_simpleSystem::testAsyncWatcherAutoReset ZooKeeper server started : elapsed
12085 : OK
     [exec] Zookeeper_simpleSystem::testDeserializeString : elapsed 0 : OK
     [exec] Zookeeper_simpleSystem::testFirstServerDown : elapsed 1001 : OK
     [exec] Zookeeper_simpleSystem::testNullData : elapsed 1019 : OK
     [exec] Zookeeper_simpleSystem::testIPV6 : elapsed 1002 : OK
     [exec] Zookeeper_simpleSystem::testPath : elapsed 1008 : OK
     [exec] Zookeeper_simpleSystem::testPathValidation : elapsed 1032 : OK
     [exec] Zookeeper_simpleSystem::testPing : elapsed 17115 : OK
     [exec] Zookeeper_simpleSystem::testAcl : elapsed 1009 : OK
     [exec] Zookeeper_simpleSystem::testChroot : elapsed 3024 : OK
     [exec] terminate called after throwing an instance of 'CppUnit::Exception'
     [exec]   what():  equality assertion failed
     [exec] - Expected: 0
     [exec] - Actual  : -116
     [exec] 
     [exec] make: *** [run-check] Aborted
     [exec] Zookeeper_simpleSystem::testAuth

BUILD FAILED
/home/jenkins/jenkins-slave/workspace/ZooKeeper_branch34/build.xml:1425: The following error
occurred while executing this line:
/home/jenkins/jenkins-slave/workspace/ZooKeeper_branch34/build.xml:1385: The following error
occurred while executing this line:
/home/jenkins/jenkins-slave/workspace/ZooKeeper_branch34/build.xml:1395: exec returned: 2

Total time: 31 minutes 3 seconds
Build step 'Execute shell' marked build as failure
Recording test results
Email was triggered for: Failure - Any
Sending email for trigger: Failure - Any



###################################################################################
############################## FAILED TESTS (if any) ##############################
All tests passed
Mime
  • Unnamed multipart/mixed (inline, None, 0 bytes)
View raw message