zookeeper-dev mailing list archives

Site index · List index
Message view « Date » · « Thread »
Top « Date » · « Thread »
From Apache Jenkins Server <jenk...@builds.apache.org>
Subject ZooKeeper-trunk - Build # 3533 - Failure
Date Mon, 11 Sep 2017 22:32:57 GMT
See https://builds.apache.org/job/ZooKeeper-trunk/3533/

###################################################################################
########################## LAST 60 LINES OF THE CONSOLE ###########################
[...truncated 66.87 MB...]
     [exec] 7f3034b24000-7f3034d23000 ---p 00003000 08:01 12195987                   /lib/x86_64-linux-gnu/libdl-2.23.so
     [exec] 7f3034d23000-7f3034d24000 r--p 00002000 08:01 12195987                   /lib/x86_64-linux-gnu/libdl-2.23.so
     [exec] 7f3034d24000-7f3034d25000 rw-p 00003000 08:01 12195987                   /lib/x86_64-linux-gnu/libdl-2.23.so
     [exec] 7f3034d25000-7f3034d5f000 r-xp 00000000 08:01 9456546                    /usr/lib/x86_64-linux-gnu/libcppunit-1.13.so.0.0.2
     [exec] 7f3034d5f000-7f3034f5f000 ---p 0003a000 08:01 9456546                    /usr/lib/x86_64-linux-gnu/libcppunit-1.13.so.0.0.2
     [exec] 7f3034f5f000-7f3034f61000 r--p 0003a000 08:01 9456546                    /usr/lib/x86_64-linux-gnu/libcppunit-1.13.so.0.0.2
     [exec] 7f3034f61000-7f3034f62000 rw-p 0003c000 08:01 9456546                    /usr/lib/x86_64-linux-gnu/libcppunit-1.13.so.0.0.2
     [exec] 7f3034f62000-7f3034f7a000 r-xp 00000000 08:01 12195981                   /lib/x86_64-linux-gnu/libpthread-2.23.so
     [exec] 7f3034f7a000-7f3035179000 ---p 00018000 08:01 12195981                   /lib/x86_64-linux-gnu/libpthread-2.23.so
     [exec] 7f3035179000-7f303517a000 r--p 00017000 08:01 12195981                   /lib/x86_64-linux-gnu/libpthread-2.23.so
     [exec] 7f303517a000-7f303517b000 rw-p 00018000 08:01 12195981                   /lib/x86_64-linux-gnu/libpthread-2.23.so
     [exec] 7f303517b000-7f303517f000 rw-p 00000000 00:00 0 
     [exec] 7f303517f000-7f30351a5000 r-xp 00000000 08:01 12195976                   /lib/x86_64-linux-gnu/ld-2.23.so
     [exec] 7f303538a000-7f3035391000 rw-p 00000000 00:00 0 
     [exec] 7f30353a1000-7f30353a4000 rw-p 00000000 00:00 0 
     [exec] 7f30353a4000-7f30353a5000 r--p 00025000 08:01 12195976                   /lib/x86_64-linux-gnu/ld-2.23.so
     [exec] 7f30353a5000-7f30353a6000 rw-p 00026000 08:01 12195976                   /lib/x86_64-linux-gnu/ld-2.23.so
     [exec] 7f30353a6000-7f30353a7000 rw-p 00000000 00:00 0 
     [exec] 7ffcea550000-7ffcea571000 rw-p 00000000 00:00 0                          [stack]
     [exec] 7ffcea5f9000-7ffcea5fb000 r--p 00000000 00:00 0                          [vvar]
     [exec] 7ffcea5fb000-7ffcea5fd000 r-xp 00000000 00:00 0                          [vdso]
     [exec] ffffffffff600000-ffffffffff601000 r-xp 00000000 00:00 0                  [vsyscall]
     [exec] /bin/bash: line 5: 12032 Aborted                 ZKROOT=/home/jenkins/jenkins-slave/workspace/ZooKeeper-trunk/src/c/../..
CLASSPATH=$CLASSPATH:$CLOVER_HOME/lib/clover.jar ${dir}$tst
     [exec] Zookeeper_readOnly::testReadOnly : elapsed 4070 : OK
     [exec] OK (74)
     [exec] FAIL: zktest-mt
     [exec] ==========================================
     [exec] 1 of 2 tests failed
     [exec] Please report to user@zookeeper.apache.org
     [exec] ==========================================
     [exec] Makefile:1744: recipe for target 'check-TESTS' failed
     [exec] make[1]: Leaving directory '/home/jenkins/jenkins-slave/workspace/ZooKeeper-trunk/build/test/test-cppunit'
     [exec] Makefile:2000: recipe for target 'check-am' failed
     [exec] make[1]: *** [check-TESTS] Error 1
     [exec] make: *** [check-am] Error 2

BUILD FAILED
/home/jenkins/jenkins-slave/workspace/ZooKeeper-trunk/build.xml:1339: The following error
occurred while executing this line:
/home/jenkins/jenkins-slave/workspace/ZooKeeper-trunk/build.xml:1299: The following error
occurred while executing this line:
/home/jenkins/jenkins-slave/workspace/ZooKeeper-trunk/build.xml:1309: exec returned: 2

Total time: 16 minutes 2 seconds
Build step 'Execute shell' marked build as failure
[FINDBUGS] Skipping publisher since build result is FAILURE
[WARNINGS] Skipping publisher since build result is FAILURE
Archiving artifacts
Setting JDK_1_7_LATEST__HOME=/home/jenkins/tools/java/latest1.7
Recording fingerprints
Setting JDK_1_7_LATEST__HOME=/home/jenkins/tools/java/latest1.7
[JIRA] Updating issue ZOOKEEPER-2777
Recording test results
Setting JDK_1_7_LATEST__HOME=/home/jenkins/tools/java/latest1.7
Publishing Javadoc
Setting JDK_1_7_LATEST__HOME=/home/jenkins/tools/java/latest1.7
Setting JDK_1_7_LATEST__HOME=/home/jenkins/tools/java/latest1.7
Email was triggered for: Failure - Any
Sending email for trigger: Failure - Any
Setting JDK_1_7_LATEST__HOME=/home/jenkins/tools/java/latest1.7
Setting JDK_1_7_LATEST__HOME=/home/jenkins/tools/java/latest1.7



###################################################################################
############################## FAILED TESTS (if any) ##############################
All tests passed
Mime
  • Unnamed multipart/mixed (inline, None, 0 bytes)
View raw message