zookeeper-dev mailing list archives

Site index · List index
Message view « Date » · « Thread »
Top « Date » · « Thread »
From Apache Jenkins Server <jenk...@builds.apache.org>
Subject ZooKeeper_branch34_jdk8 - Build # 1132 - Failure
Date Mon, 18 Sep 2017 22:58:41 GMT
See https://builds.apache.org/job/ZooKeeper_branch34_jdk8/1132/

###################################################################################
########################## LAST 60 LINES OF THE CONSOLE ###########################
[...truncated 32.44 MB...]
    [junit] 	at java.io.BufferedOutputStream.flushBuffer(BufferedOutputStream.java:82)
    [junit] 	at java.io.BufferedOutputStream.write(BufferedOutputStream.java:95)
    [junit] 	at java.util.zip.CheckedOutputStream.write(CheckedOutputStream.java:60)
    [junit] 	at java.io.DataOutputStream.writeInt(DataOutputStream.java:199)
    [junit] 	at org.apache.jute.BinaryOutputArchive.writeInt(BinaryOutputArchive.java:55)
    [junit] 	at org.apache.zookeeper.data.StatPersisted.serialize(StatPersisted.java:119)
    [junit] 	at org.apache.zookeeper.server.DataNode.serialize(DataNode.java:177)
    [junit] 	at org.apache.jute.BinaryOutputArchive.writeRecord(BinaryOutputArchive.java:123)
    [junit] 	at org.apache.zookeeper.server.DataTree.serializeNode(DataTree.java:1041)
    [junit] 	at org.apache.zookeeper.server.DataTree.serializeNode(DataTree.java:1050)
    [junit] 	at org.apache.zookeeper.server.DataTree.serialize(DataTree.java:1061)
    [junit] 	at org.apache.zookeeper.server.util.SerializeUtils.serializeSnapshot(SerializeUtils.java:138)
    [junit] 	at org.apache.zookeeper.server.persistence.FileSnap.serialize(FileSnap.java:215)
    [junit] 	at org.apache.zookeeper.server.persistence.FileSnap.serialize(FileSnap.java:232)
    [junit] 	at org.apache.zookeeper.server.persistence.FileTxnSnapLog.save(FileTxnSnapLog.java:250)
    [junit] 	at org.apache.zookeeper.server.ZooKeeperServer.takeSnapshot(ZooKeeperServer.java:303)
    [junit] 	at org.apache.zookeeper.server.SyncRequestProcessor$1.run(SyncRequestProcessor.java:153)
    [junit] 2017-09-18 22:58:38,965 [myid:] - ERROR [Snapshot Thread:ZooKeeperServer@305]
- Severe unrecoverable error, exiting
    [junit] java.io.IOException: No space left on device
    [junit] 	at java.io.FileOutputStream.writeBytes(Native Method)
    [junit] 	at java.io.FileOutputStream.write(FileOutputStream.java:326)
    [junit] 	at java.io.BufferedOutputStream.flushBuffer(BufferedOutputStream.java:82)
    [junit] 	at java.io.BufferedOutputStream.flush(BufferedOutputStream.java:140)
    [junit] 	at org.apache.zookeeper.server.persistence.FileSnap.serialize(FileSnap.java:236)
    [junit] 	at org.apache.zookeeper.server.persistence.FileTxnSnapLog.save(FileTxnSnapLog.java:250)
    [junit] 	at org.apache.zookeeper.server.ZooKeeperServer.takeSnapshot(ZooKeeperServer.java:303)
    [junit] 	at org.apache.zookeeper.server.SyncRequestProcessor$1.run(SyncRequestProcessor.java:153)
    [junit] 2017-09-18 22:58:38,965 [myid:] - ERROR [Snapshot Thread:ZooKeeperServer@305]
- Severe unrecoverable error, exiting
    [junit] java.io.IOException: No space left on device
    [junit] 	at java.io.FileOutputStream.writeBytes(Native Method)
    [junit] 	at java.io.FileOutputStream.write(FileOutputStream.java:326)
    [junit] 	at java.io.BufferedOutputStream.flushBuffer(BufferedOutputStream.java:82)
    [junit] 	at java.io.BufferedOutputStream.write(BufferedOutputStream.java:95)
    [junit] 	at java.util.zip.CheckedOutputStream.write(CheckedOutputStream.java:60)
    [junit] 	at java.io.DataOutputStream.writeInt(DataOutputStream.java:199)
    [junit] 	at org.apache.jute.BinaryOutputArchive.writeInt(BinaryOutputArchive.java:55)
    [junit] 	at org.apache.zookeeper.data.StatPersisted.serialize(StatPersisted.java:119)
    [junit] 	at org.apache.zookeeper.server.DataNode.serialize(DataNode.java:177)
    [junit] 	at org.apache.jute.BinaryOutputArchive.writeRecord(BinaryOutputArchive.java:123)
    [junit] 	at org.apache.zookeeper.server.DataTree.serializeNode(DataTree.java:1041)
    [junit] 	at org.apache.zookeeper.server.DataTree.serializeNode(DataTree.java:1050)
    [junit] 	at org.apache.zookeeper.server.DataTree.serialize(DataTree.java:1061)
    [junit] 	at org.apache.zookeeper.server.util.SerializeUtils.serializeSnapshot(SerializeUtils.java:138)
    [junit] 	at org.apache.zookeeper.server.persistence.FileSnap.serialize(FileSnap.java:215)
    [junit] 	at org.apache.zookeeper.server.persistence.FileSnap.serialize(FileSnap.java:232)
    [junit] 	at org.apache.zookeeper.server.persistence.FileTxnSnapLog.save(FileTxnSnapLog.java:250)
    [junit] 	at org.apache.zookeeper.server.ZooKeeperServer.takeSnapshot(ZooKeeperServer.java:303)
    [junit] 	at org.apache.zookeeper.server.SyncRequestProcessor$1.run(SyncRequestProcessor.java:153)
    [junit] 2017-09-18 22:58:38,968 [myid:] - INFO  [SyncThread:2:ZooKeeperServerListenerImpl@42]
- Thread SyncThread:2 exits, error code 1
    [junit] 2017-09-18 22:58:38,969 [myid:] - INFO  [SyncThread:2:SyncRequestProcessor@186]
- SyncRequestProcessor exited!

BUILD FAILED
/home/jenkins/jenkins-slave/workspace/ZooKeeper_branch34_jdk8/build.xml:1302: Unable to write
log file

Total time: 29 minutes 24 seconds
Build step 'Invoke Ant' marked build as failure
Recording test results
Email was triggered for: Failure - Any
Sending email for trigger: Failure - Any



###################################################################################
############################## FAILED TESTS (if any) ##############################
1 tests failed.
FAILED:  TEST-org.apache.zookeeper.test.ZkDatabaseCorruptionTest.xml.[failed-to-read]

Error Message:


Stack Trace:
Failed to read test report file /home/jenkins/jenkins-slave/workspace/ZooKeeper_branch34_jdk8/build/test/logs/TEST-org.apache.zookeeper.test.ZkDatabaseCorruptionTest.xml
org.dom4j.DocumentException: Error on line 341 of document  : XML document structures must
start and end within the same entity. Nested exception: XML document structures must start
and end within the same entity.
	at org.dom4j.io.SAXReader.read(SAXReader.java:482)
	at org.dom4j.io.SAXReader.read(SAXReader.java:343)
	at hudson.tasks.junit.SuiteResult.parse(SuiteResult.java:132)
	at hudson.tasks.junit.TestResult.parse(TestResult.java:302)
	at hudson.tasks.junit.TestResult.parsePossiblyEmpty(TestResult.java:244)
	at hudson.tasks.junit.TestResult.parse(TestResult.java:175)
	at hudson.tasks.junit.TestResult.parse(TestResult.java:154)
	at hudson.tasks.junit.TestResult.<init>(TestResult.java:126)
	at hudson.tasks.junit.JUnitParser$ParseResultCallable.invoke(JUnitParser.java:132)
	at hudson.tasks.junit.JUnitParser$ParseResultCallable.invoke(JUnitParser.java:107)
	at hudson.FilePath$FileCallableWrapper.call(FilePath.java:2739)
	at hudson.remoting.UserRequest.perform(UserRequest.java:153)
	at hudson.remoting.UserRequest.perform(UserRequest.java:50)
	at hudson.remoting.Request$2.run(Request.java:336)
	at hudson.remoting.InterceptingExecutorService$1.call(InterceptingExecutorService.java:68)
	at java.util.concurrent.FutureTask.run(FutureTask.java:266)
	at java.util.concurrent.ThreadPoolExecutor.runWorker(ThreadPoolExecutor.java:1142)
	at java.util.concurrent.ThreadPoolExecutor$Worker.run(ThreadPoolExecutor.java:617)
	at java.lang.Thread.run(Thread.java:748)
Caused by: org.xml.sax.SAXParseException; lineNumber: 341; columnNumber: 765; XML document
structures must start and end within the same entity.
	at com.sun.org.apache.xerces.internal.util.ErrorHandlerWrapper.createSAXParseException(ErrorHandlerWrapper.java:203)
	at com.sun.org.apache.xerces.internal.util.ErrorHandlerWrapper.fatalError(ErrorHandlerWrapper.java:177)
	at com.sun.org.apache.xerces.internal.impl.XMLErrorReporter.reportError(XMLErrorReporter.java:400)
	at com.sun.org.apache.xerces.internal.impl.XMLErrorReporter.reportError(XMLErrorReporter.java:327)
	at com.sun.org.apache.xerces.internal.impl.XMLScanner.reportFatalError(XMLScanner.java:1472)
	at com.sun.org.apache.xerces.internal.impl.XMLDocumentFragmentScannerImpl.endEntity(XMLDocumentFragmentScannerImpl.java:899)
	at com.sun.org.apache.xerces.internal.impl.XMLDocumentScannerImpl.endEntity(XMLDocumentScannerImpl.java:559)
	at com.sun.org.apache.xerces.internal.impl.XMLEntityManager.endEntity(XMLEntityManager.java:1398)
	at com.sun.org.apache.xerces.internal.impl.XMLEntityScanner.load(XMLEntityScanner.java:1916)
	at com.sun.org.apache.xerces.internal.impl.XMLEntityScanner.scanLiteral(XMLEntityScanner.java:1187)
	at com.sun.org.apache.xerces.internal.impl.XMLScanner.scanAttributeValue(XMLScanner.java:987)
	at com.sun.org.apache.xerces.internal.impl.XMLNSDocumentScannerImpl.scanAttribute(XMLNSDocumentScannerImpl.java:447)
	at com.sun.org.apache.xerces.internal.impl.XMLNSDocumentScannerImpl.scanStartElement(XMLNSDocumentScannerImpl.java:250)
	at com.sun.org.apache.xerces.internal.impl.XMLDocumentFragmentScannerImpl$FragmentContentDriver.next(XMLDocumentFragmentScannerImpl.java:2784)
	at com.sun.org.apache.xerces.internal.impl.XMLDocumentScannerImpl.next(XMLDocumentScannerImpl.java:602)
	at com.sun.org.apache.xerces.internal.impl.XMLNSDocumentScannerImpl.next(XMLNSDocumentScannerImpl.java:112)
	at com.sun.org.apache.xerces.internal.impl.XMLDocumentFragmentScannerImpl.scanDocument(XMLDocumentFragmentScannerImpl.java:505)
	at com.sun.org.apache.xerces.internal.parsers.XML11Configuration.parse(XML11Configuration.java:841)
	at com.sun.org.apache.xerces.internal.parsers.XML11Configuration.parse(XML11Configuration.java:770)
	at com.sun.org.apache.xerces.internal.parsers.XMLParser.parse(XMLParser.java:141)
	at com.sun.org.apache.xerces.internal.parsers.AbstractSAXParser.parse(AbstractSAXParser.java:1213)
	at com.sun.org.apache.xerces.internal.jaxp.SAXParserImpl$JAXPSAXParser.parse(SAXParserImpl.java:643)
	at org.dom4j.io.SAXReader.read(SAXReader.java:465)
	... 18 more
Nested exception: 
org.xml.sax.SAXParseException; lineNumber: 341; columnNumber: 765; XML document structures
must start and end within the same entity.
	at com.sun.org.apache.xerces.internal.util.ErrorHandlerWrapper.createSAXParseException(ErrorHandlerWrapper.java:203)
	at com.sun.org.apache.xerces.internal.util.ErrorHandlerWrapper.fatalError(ErrorHandlerWrapper.java:177)
	at com.sun.org.apache.xerces.internal.impl.XMLErrorReporter.reportError(XMLErrorReporter.java:400)
	at com.sun.org.apache.xerces.internal.impl.XMLErrorReporter.reportError(XMLErrorReporter.java:327)
	at com.sun.org.apache.xerces.internal.impl.XMLScanner.reportFatalError(XMLScanner.java:1472)
	at com.sun.org.apache.xerces.internal.impl.XMLDocumentFragmentScannerImpl.endEntity(XMLDocumentFragmentScannerImpl.java:899)
	at com.sun.org.apache.xerces.internal.impl.XMLDocumentScannerImpl.endEntity(XMLDocumentScannerImpl.java:559)
	at com.sun.org.apache.xerces.internal.impl.XMLEntityManager.endEntity(XMLEntityManager.java:1398)
	at com.sun.org.apache.xerces.internal.impl.XMLEntityScanner.load(XMLEntityScanner.java:1916)
	at com.sun.org.apache.xerces.internal.impl.XMLEntityScanner.scanLiteral(XMLEntityScanner.java:1187)
	at com.sun.org.apache.xerces.internal.impl.XMLScanner.scanAttributeValue(XMLScanner.java:987)
	at com.sun.org.apache.xerces.internal.impl.XMLNSDocumentScannerImpl.scanAttribute(XMLNSDocumentScannerImpl.java:447)
	at com.sun.org.apache.xerces.internal.impl.XMLNSDocumentScannerImpl.scanStartElement(XMLNSDocumentScannerImpl.java:250)
	at com.sun.org.apache.xerces.internal.impl.XMLDocumentFragmentScannerImpl$FragmentContentDriver.next(XMLDocumentFragmentScannerImpl.java:2784)
	at com.sun.org.apache.xerces.internal.impl.XMLDocumentScannerImpl.next(XMLDocumentScannerImpl.java:602)
	at com.sun.org.apache.xerces.internal.impl.XMLNSDocumentScannerImpl.next(XMLNSDocumentScannerImpl.java:112)
	at com.sun.org.apache.xerces.internal.impl.XMLDocumentFragmentScannerImpl.scanDocument(XMLDocumentFragmentScannerImpl.java:505)
	at com.sun.org.apache.xerces.internal.parsers.XML11Configuration.parse(XML11Configuration.java:841)
	at com.sun.org.apache.xerces.internal.parsers.XML11Configuration.parse(XML11Configuration.java:770)
	at com.sun.org.apache.xerces.internal.parsers.XMLParser.parse(XMLParser.java:141)
	at com.sun.org.apache.xerces.internal.parsers.AbstractSAXParser.parse(AbstractSAXParser.java:1213)
	at com.sun.org.apache.xerces.internal.jaxp.SAXParserImpl$JAXPSAXParser.parse(SAXParserImpl.java:643)
	at org.dom4j.io.SAXReader.read(SAXReader.java:465)
	at org.dom4j.io.SAXReader.read(SAXReader.java:343)
	at hudson.tasks.junit.SuiteResult.parse(SuiteResult.java:132)
	at hudson.tasks.junit.TestResult.parse(TestResult.java:302)
	at hudson.tasks.junit.TestResult.parsePossiblyEmpty(TestResult.java:244)
	at hudson.tasks.junit.TestResult.parse(TestResult.java:175)
	at hudson.tasks.junit.TestResult.parse(TestResult.java:154)
	at hudson.tasks.junit.TestResult.<init>(TestResult.java:126)
	at hudson.tasks.junit.JUnitParser$ParseResultCallable.invoke(JUnitParser.java:132)
	at hudson.tasks.junit.JUnitParser$ParseResultCallable.invoke(JUnitParser.java:107)
	at hudson.FilePath$FileCallableWrapper.call(FilePath.java:2739)
	at hudson.remoting.UserRequest.perform(UserRequest.java:153)
	at hudson.remoting.UserRequest.perform(UserRequest.java:50)
	at hudson.remoting.Request$2.run(Request.java:336)
	at hudson.remoting.InterceptingExecutorService$1.call(InterceptingExecutorService.java:68)
	at java.util.concurrent.FutureTask.run(FutureTask.java:266)
	at java.util.concurrent.ThreadPoolExecutor.runWorker(ThreadPoolExecutor.java:1142)
	at java.util.concurrent.ThreadPoolExecutor$Worker.run(ThreadPoolExecutor.java:617)
	at java.lang.Thread.run(Thread.java:748)
Mime
  • Unnamed multipart/mixed (inline, None, 0 bytes)
View raw message