zookeeper-dev mailing list archives

Site index · List index
Message view « Date » · « Thread »
Top « Date » · « Thread »
From Apache Jenkins Server <jenk...@builds.apache.org>
Subject ZooKeeper-trunk - Build # 3548 - Failure
Date Mon, 25 Sep 2017 23:26:44 GMT
See https://builds.apache.org/job/ZooKeeper-trunk/3548/

###################################################################################
########################## LAST 60 LINES OF THE CONSOLE ###########################
[...truncated 65.60 MB...]
    [junit] 2017-09-25 23:26:32,730 [myid:127.0.0.1:30199] - INFO  [main-SendThread(127.0.0.1:30199):ClientCnxn$SendThread@1113]
- Opening socket connection to server 127.0.0.1/127.0.0.1:30199. Will not attempt to authenticate
using SASL (unknown error)
    [junit] 2017-09-25 23:26:32,730 [myid:127.0.0.1:30199] - WARN  [main-SendThread(127.0.0.1:30199):ClientCnxn$SendThread@1235]
- Session 0x201a7fc9e000000 for server 127.0.0.1/127.0.0.1:30199, unexpected error, closing
socket connection and attempting reconnect
    [junit] java.net.ConnectException: Connection refused
    [junit] 	at sun.nio.ch.SocketChannelImpl.checkConnect(Native Method)
    [junit] 	at sun.nio.ch.SocketChannelImpl.finishConnect(SocketChannelImpl.java:744)
    [junit] 	at org.apache.zookeeper.ClientCnxnSocketNIO.doTransport(ClientCnxnSocketNIO.java:357)
    [junit] 	at org.apache.zookeeper.ClientCnxn$SendThread.run(ClientCnxn.java:1214)
    [junit] 2017-09-25 23:26:32,818 [myid:] - INFO  [ProcessThread(sid:0 cport:30319)::PrepRequestProcessor@614]
- Processed session termination for sessionid: 0x101a7ffdec60000
    [junit] 2017-09-25 23:26:32,819 [myid:] - INFO  [SyncThread:0:MBeanRegistry@128] - Unregister
MBean [org.apache.ZooKeeperService:name0=StandaloneServer_port30319,name1=Connections,name2=127.0.0.1,name3=0x101a7ffdec60000]
    [junit] 2017-09-25 23:26:32,819 [myid:] - INFO  [main:ZooKeeper@1332] - Session: 0x101a7ffdec60000
closed
    [junit] 2017-09-25 23:26:32,820 [myid:] - INFO  [main-EventThread:ClientCnxn$EventThread@513]
- EventThread shut down for session: 0x101a7ffdec60000
    [junit] 2017-09-25 23:26:32,820 [myid:] - INFO  [main:JUnit4ZKTestRunner$LoggedInvokeMethod@82]
- Memory used 201373
    [junit] 2017-09-25 23:26:32,820 [myid:] - INFO  [main:JUnit4ZKTestRunner$LoggedInvokeMethod@87]
- Number of threads 1647
    [junit] 2017-09-25 23:26:32,820 [myid:] - INFO  [main:JUnit4ZKTestRunner$LoggedInvokeMethod@102]
- FINISHED TEST METHOD testWatcherAutoResetWithLocal
    [junit] 2017-09-25 23:26:32,820 [myid:] - INFO  [main:ClientBase@601] - tearDown starting
    [junit] 2017-09-25 23:26:32,820 [myid:] - INFO  [main:ClientBase@571] - STOPPING server
    [junit] 2017-09-25 23:26:32,820 [myid:] - INFO  [main:NettyServerCnxnFactory@464] - shutdown
called 0.0.0.0/0.0.0.0:30319
    [junit] 2017-09-25 23:26:32,827 [myid:] - INFO  [main:ZooKeeperServer@545] - shutting
down
    [junit] 2017-09-25 23:26:32,827 [myid:] - ERROR [main:ZooKeeperServer@509] - ZKShutdownHandler
is not registered, so ZooKeeper server won't take any action on ERROR or SHUTDOWN server state
changes
    [junit] 2017-09-25 23:26:32,827 [myid:] - INFO  [main:SessionTrackerImpl@232] - Shutting
down
    [junit] 2017-09-25 23:26:32,827 [myid:] - INFO  [main:PrepRequestProcessor@1010] - Shutting
down
    [junit] 2017-09-25 23:26:32,829 [myid:] - INFO  [main:SyncRequestProcessor@191] - Shutting
down
    [junit] 2017-09-25 23:26:32,829 [myid:] - INFO  [ProcessThread(sid:0 cport:30319)::PrepRequestProcessor@155]
- PrepRequestProcessor exited loop!
    [junit] 2017-09-25 23:26:32,829 [myid:] - INFO  [SyncThread:0:SyncRequestProcessor@169]
- SyncRequestProcessor exited!
    [junit] 2017-09-25 23:26:32,830 [myid:] - INFO  [main:FinalRequestProcessor@481] - shutdown
of request processor complete
    [junit] 2017-09-25 23:26:32,830 [myid:] - INFO  [main:MBeanRegistry@128] - Unregister
MBean [org.apache.ZooKeeperService:name0=StandaloneServer_port30319,name1=InMemoryDataTree]
    [junit] 2017-09-25 23:26:32,830 [myid:] - INFO  [main:MBeanRegistry@128] - Unregister
MBean [org.apache.ZooKeeperService:name0=StandaloneServer_port30319]
    [junit] 2017-09-25 23:26:32,830 [myid:] - INFO  [main:FourLetterWordMain@87] - connecting
to 127.0.0.1 30319
    [junit] 2017-09-25 23:26:32,830 [myid:] - INFO  [main:JMXEnv@146] - ensureOnly:[]
    [junit] 2017-09-25 23:26:32,835 [myid:] - INFO  [main:ClientBase@626] - fdcount after
test is: 4843 at start it was 4843
    [junit] 2017-09-25 23:26:32,835 [myid:] - INFO  [main:ZKTestCase$1@68] - SUCCEEDED testWatcherAutoResetWithLocal
    [junit] 2017-09-25 23:26:32,835 [myid:] - INFO  [main:ZKTestCase$1@63] - FINISHED testWatcherAutoResetWithLocal
    [junit] Tests run: 105, Failures: 0, Errors: 0, Skipped: 0, Time elapsed: 410.52 sec,
Thread: 8, Class: org.apache.zookeeper.test.NioNettySuiteTest
    [junit] 2017-09-25 23:26:33,072 [myid:] - INFO  [SessionTracker:SessionTrackerImpl@158]
- SessionTrackerImpl exited loop!

fail.build.on.test.failure:

BUILD FAILED
/home/jenkins/jenkins-slave/workspace/ZooKeeper-trunk/build.xml:1339: The following error
occurred while executing this line:
/home/jenkins/jenkins-slave/workspace/ZooKeeper-trunk/build.xml:1220: The following error
occurred while executing this line:
/home/jenkins/jenkins-slave/workspace/ZooKeeper-trunk/build.xml:1224: Tests failed!

Total time: 9 minutes 55 seconds
Build step 'Execute shell' marked build as failure
[FINDBUGS] Skipping publisher since build result is FAILURE
[WARNINGS] Skipping publisher since build result is FAILURE
Archiving artifacts
Setting JDK_1_7_LATEST__HOME=/home/jenkins/tools/java/latest1.7
Recording fingerprints
Setting JDK_1_7_LATEST__HOME=/home/jenkins/tools/java/latest1.7
Recording test results
Setting JDK_1_7_LATEST__HOME=/home/jenkins/tools/java/latest1.7
Publishing Javadoc
Setting JDK_1_7_LATEST__HOME=/home/jenkins/tools/java/latest1.7
Setting JDK_1_7_LATEST__HOME=/home/jenkins/tools/java/latest1.7
Email was triggered for: Failure - Any
Sending email for trigger: Failure - Any
Setting JDK_1_7_LATEST__HOME=/home/jenkins/tools/java/latest1.7
Setting JDK_1_7_LATEST__HOME=/home/jenkins/tools/java/latest1.7



###################################################################################
############################## FAILED TESTS (if any) ##############################
2 tests failed.
FAILED:  org.apache.zookeeper.server.quorum.ReconfigFailureCasesTest.testLeaderTimesoutOnNewQuorum

Error Message:
Should have been ConnectionLossException!

Stack Trace:
junit.framework.AssertionFailedError: Should have been ConnectionLossException!
	at org.apache.zookeeper.server.quorum.ReconfigFailureCasesTest.testLeaderTimesoutOnNewQuorum(ReconfigFailureCasesTest.java:191)
	at org.apache.zookeeper.JUnit4ZKTestRunner$LoggedInvokeMethod.evaluate(JUnit4ZKTestRunner.java:79)


FAILED:  org.apache.zookeeper.server.quorum.StandaloneDisabledTest.startSingleServerTest

Error Message:
Error- Server started in Standalone Mode!

Stack Trace:
junit.framework.AssertionFailedError: Error- Server started in Standalone Mode!
	at org.apache.zookeeper.server.quorum.StandaloneDisabledTest.startServer(StandaloneDisabledTest.java:177)
	at org.apache.zookeeper.server.quorum.StandaloneDisabledTest.startObservers(StandaloneDisabledTest.java:222)
	at org.apache.zookeeper.server.quorum.StandaloneDisabledTest.startSingleServerTest(StandaloneDisabledTest.java:111)
	at org.apache.zookeeper.JUnit4ZKTestRunner$LoggedInvokeMethod.evaluate(JUnit4ZKTestRunner.java:79)
Mime
  • Unnamed multipart/mixed (inline, None, 0 bytes)
View raw message