zookeeper-dev mailing list archives

Site index · List index
Message view « Date » · « Thread »
Top « Date » · « Thread »
From Apache Jenkins Server <jenk...@builds.apache.org>
Subject ZooKeeper-trunk-jdk8 - Build # 1192 - Still Failing
Date Wed, 06 Sep 2017 11:56:08 GMT
See https://builds.apache.org/job/ZooKeeper-trunk-jdk8/1192/

###################################################################################
########################## LAST 60 LINES OF THE CONSOLE ###########################
[...truncated 60.31 MB...]
    [junit] 	at java.util.concurrent.ThreadPoolExecutor.runWorker(ThreadPoolExecutor.java:1149)
    [junit] 	at java.util.concurrent.ThreadPoolExecutor$Worker.run(ThreadPoolExecutor.java:624)
    [junit] 	at java.lang.Thread.run(Thread.java:748)
    [junit] 2017-09-06 11:56:05,531 [myid:] - INFO  [main:JUnit4ZKTestRunner$LoggedInvokeMethod@82]
- Memory used 101457
    [junit] 2017-09-06 11:56:05,531 [myid:] - INFO  [main:JUnit4ZKTestRunner$LoggedInvokeMethod@87]
- Number of threads 863
    [junit] 2017-09-06 11:56:05,532 [myid:] - INFO  [main:JUnit4ZKTestRunner$LoggedInvokeMethod@102]
- FINISHED TEST METHOD testWatcherAutoResetWithLocal
    [junit] 2017-09-06 11:56:05,532 [myid:] - INFO  [main:ClientBase@601] - tearDown starting
    [junit] 2017-09-06 11:56:05,532 [myid:] - INFO  [main:ClientBase@571] - STOPPING server
    [junit] 2017-09-06 11:56:05,532 [myid:] - INFO  [main:NettyServerCnxnFactory@464] - shutdown
called 0.0.0.0/0.0.0.0:22240
    [junit] 2017-09-06 11:56:05,534 [myid:] - INFO  [main:ZooKeeperServer@545] - shutting
down
    [junit] 2017-09-06 11:56:05,534 [myid:] - ERROR [main:ZooKeeperServer@509] - ZKShutdownHandler
is not registered, so ZooKeeper server won't take any action on ERROR or SHUTDOWN server state
changes
    [junit] 2017-09-06 11:56:05,534 [myid:] - INFO  [main:SessionTrackerImpl@232] - Shutting
down
    [junit] 2017-09-06 11:56:05,535 [myid:] - INFO  [main:PrepRequestProcessor@1010] - Shutting
down
    [junit] 2017-09-06 11:56:05,535 [myid:] - INFO  [main:SyncRequestProcessor@191] - Shutting
down
    [junit] 2017-09-06 11:56:05,535 [myid:] - INFO  [ProcessThread(sid:0 cport:22240)::PrepRequestProcessor@155]
- PrepRequestProcessor exited loop!
    [junit] 2017-09-06 11:56:05,535 [myid:] - INFO  [SyncThread:0:SyncRequestProcessor@169]
- SyncRequestProcessor exited!
    [junit] 2017-09-06 11:56:05,535 [myid:] - INFO  [main:FinalRequestProcessor@481] - shutdown
of request processor complete
    [junit] 2017-09-06 11:56:05,535 [myid:] - INFO  [main:MBeanRegistry@128] - Unregister
MBean [org.apache.ZooKeeperService:name0=StandaloneServer_port22240,name1=InMemoryDataTree]
    [junit] 2017-09-06 11:56:05,536 [myid:] - INFO  [main:MBeanRegistry@128] - Unregister
MBean [org.apache.ZooKeeperService:name0=StandaloneServer_port22240]
    [junit] 2017-09-06 11:56:05,536 [myid:] - INFO  [main:FourLetterWordMain@87] - connecting
to 127.0.0.1 22240
    [junit] 2017-09-06 11:56:05,536 [myid:] - INFO  [main:JMXEnv@146] - ensureOnly:[]
    [junit] 2017-09-06 11:56:05,541 [myid:] - INFO  [main:ClientBase@626] - fdcount after
test is: 2545 at start it was 2545
    [junit] 2017-09-06 11:56:05,541 [myid:] - INFO  [main:ZKTestCase$1@68] - SUCCEEDED testWatcherAutoResetWithLocal
    [junit] 2017-09-06 11:56:05,547 [myid:] - INFO  [main:ZKTestCase$1@63] - FINISHED testWatcherAutoResetWithLocal
    [junit] Tests run: 105, Failures: 0, Errors: 0, Skipped: 0, Time elapsed: 432.574 sec,
Thread: 5, Class: org.apache.zookeeper.test.NioNettySuiteTest
    [junit] 2017-09-06 11:56:05,793 [myid:127.0.0.1:22123] - INFO  [main-SendThread(127.0.0.1:22123):ClientCnxn$SendThread@1113]
- Opening socket connection to server 127.0.0.1/127.0.0.1:22123. Will not attempt to authenticate
using SASL (unknown error)
    [junit] 2017-09-06 11:56:05,794 [myid:127.0.0.1:22123] - WARN  [main-SendThread(127.0.0.1:22123):ClientCnxn$SendThread@1235]
- Session 0x305d07a37de0000 for server 127.0.0.1/127.0.0.1:22123, unexpected error, closing
socket connection and attempting reconnect
    [junit] java.net.ConnectException: Connection refused
    [junit] 	at sun.nio.ch.SocketChannelImpl.checkConnect(Native Method)
    [junit] 	at sun.nio.ch.SocketChannelImpl.finishConnect(SocketChannelImpl.java:717)
    [junit] 	at org.apache.zookeeper.ClientCnxnSocketNIO.doTransport(ClientCnxnSocketNIO.java:357)
    [junit] 	at org.apache.zookeeper.ClientCnxn$SendThread.run(ClientCnxn.java:1214)
    [junit] 2017-09-06 11:56:05,947 [myid:127.0.0.1:21994] - INFO  [main-SendThread(127.0.0.1:21994):ClientCnxn$SendThread@1113]
- Opening socket connection to server 127.0.0.1/127.0.0.1:21994. Will not attempt to authenticate
using SASL (unknown error)
    [junit] 2017-09-06 11:56:05,947 [myid:127.0.0.1:21994] - WARN  [main-SendThread(127.0.0.1:21994):ClientCnxn$SendThread@1235]
- Session 0x105d07713480000 for server 127.0.0.1/127.0.0.1:21994, unexpected error, closing
socket connection and attempting reconnect
    [junit] java.net.ConnectException: Connection refused
    [junit] 	at sun.nio.ch.SocketChannelImpl.checkConnect(Native Method)
    [junit] 	at sun.nio.ch.SocketChannelImpl.finishConnect(SocketChannelImpl.java:717)
    [junit] 	at org.apache.zookeeper.ClientCnxnSocketNIO.doTransport(ClientCnxnSocketNIO.java:357)
    [junit] 	at org.apache.zookeeper.ClientCnxn$SendThread.run(ClientCnxn.java:1214)
    [junit] 2017-09-06 11:56:05,949 [myid:127.0.0.1:22043] - INFO  [main-SendThread(127.0.0.1:22043):ClientCnxn$SendThread@1113]
- Opening socket connection to server 127.0.0.1/127.0.0.1:22043. Will not attempt to authenticate
using SASL (unknown error)
    [junit] 2017-09-06 11:56:05,949 [myid:127.0.0.1:22043] - WARN  [main-SendThread(127.0.0.1:22043):ClientCnxn$SendThread@1235]
- Session 0x105d0777b7c0001 for server 127.0.0.1/127.0.0.1:22043, unexpected error, closing
socket connection and attempting reconnect
    [junit] java.net.ConnectException: Connection refused
    [junit] 	at sun.nio.ch.SocketChannelImpl.checkConnect(Native Method)
    [junit] 	at sun.nio.ch.SocketChannelImpl.finishConnect(SocketChannelImpl.java:717)
    [junit] 	at org.apache.zookeeper.ClientCnxnSocketNIO.doTransport(ClientCnxnSocketNIO.java:357)
    [junit] 	at org.apache.zookeeper.ClientCnxn$SendThread.run(ClientCnxn.java:1214)

fail.build.on.test.failure:

BUILD FAILED
/home/jenkins/jenkins-slave/workspace/ZooKeeper-trunk-jdk8/build.xml:1220: The following error
occurred while executing this line:
/home/jenkins/jenkins-slave/workspace/ZooKeeper-trunk-jdk8/build.xml:1224: Tests failed!

Total time: 12 minutes 1 second
Build step 'Invoke Ant' marked build as failure
[WARNINGS] Skipping publisher since build result is FAILURE
Recording test results
Email was triggered for: Failure - Any
Sending email for trigger: Failure - Any



###################################################################################
############################## FAILED TESTS (if any) ##############################
1 tests failed.
FAILED:  org.apache.zookeeper.test.WatchEventWhenAutoResetTest.testNodeDataChanged

Error Message:
expected:<NodeDataChanged> but was:<NodeDeleted>

Stack Trace:
junit.framework.AssertionFailedError: expected:<NodeDataChanged> but was:<NodeDeleted>
	at org.apache.zookeeper.test.WatchEventWhenAutoResetTest$EventsWatcher.assertEvent(WatchEventWhenAutoResetTest.java:67)
	at org.apache.zookeeper.test.WatchEventWhenAutoResetTest.testNodeDataChanged(WatchEventWhenAutoResetTest.java:117)
	at org.apache.zookeeper.JUnit4ZKTestRunner$LoggedInvokeMethod.evaluate(JUnit4ZKTestRunner.java:79)
Mime
  • Unnamed multipart/mixed (inline, None, 0 bytes)
View raw message