zookeeper-dev mailing list archives

Site index · List index
Message view « Date » · « Thread »
Top « Date » · « Thread »
From Apache Jenkins Server <jenk...@builds.apache.org>
Subject ZooKeeper_branch34_jdk7 - Build # 1642 - Still Failing
Date Tue, 05 Sep 2017 02:12:40 GMT
See https://builds.apache.org/job/ZooKeeper_branch34_jdk7/1642/

###################################################################################
########################## LAST 60 LINES OF THE CONSOLE ###########################
Started by timer
[EnvInject] - Loading node environment variables.
ERROR: SEVERE ERROR occurs
org.jenkinsci.lib.envinject.EnvInjectException: java.io.IOException: Remote call on H5 failed
	at org.jenkinsci.plugins.envinject.EnvInjectListener.loadEnvironmentVariablesNode(EnvInjectListener.java:86)
	at org.jenkinsci.plugins.envinject.EnvInjectListener.setUpEnvironment(EnvInjectListener.java:43)
	at hudson.model.AbstractBuild$AbstractBuildExecution.createLauncher(AbstractBuild.java:528)
	at hudson.model.AbstractBuild$AbstractBuildExecution.run(AbstractBuild.java:448)
	at hudson.model.Run.execute(Run.java:1735)
	at hudson.model.FreeStyleBuild.run(FreeStyleBuild.java:43)
	at hudson.model.ResourceController.execute(ResourceController.java:97)
	at hudson.model.Executor.run(Executor.java:405)
Caused by: java.io.IOException: Remote call on H5 failed
	at hudson.remoting.Channel.call(Channel.java:838)
	at hudson.FilePath.act(FilePath.java:1081)
	at org.jenkinsci.plugins.envinject.service.EnvInjectActionSetter.addEnvVarsToRun(EnvInjectActionSetter.java:59)
	at org.jenkinsci.plugins.envinject.EnvInjectListener.loadEnvironmentVariablesNode(EnvInjectListener.java:83)
	... 7 more
Caused by: java.lang.OutOfMemoryError: Java heap space
ERROR: Step ?Publish JUnit test result report? failed: no workspace for ZooKeeper_branch34_jdk7
#1642
[EnvInject] - [ERROR] - SEVERE ERROR occurs: Remote call on H5 failed
Email was triggered for: Failure - Any
Sending email for trigger: Failure - Any



###################################################################################
############################## FAILED TESTS (if any) ##############################
No tests ran.
Mime
  • Unnamed multipart/mixed (inline, None, 0 bytes)
View raw message