zookeeper-dev mailing list archives

Site index · List index
Message view « Date » · « Thread »
Top « Date » · « Thread »
From Apache Jenkins Server <jenk...@builds.apache.org>
Subject ZooKeeper-trunk - Build # 3552 - Failure
Date Wed, 27 Sep 2017 23:34:52 GMT
See https://builds.apache.org/job/ZooKeeper-trunk/3552/

###################################################################################
########################## LAST 60 LINES OF THE CONSOLE ###########################
[...truncated 66.49 MB...]
    [junit] 2017-09-27 23:26:20,913 [myid:] - INFO  [NIOServerCxnFactory.AcceptThread:/127.0.0.1:16769:NIOServerCnxnFactory$AcceptThread@219]
- accept thread exitted run method
    [junit] 2017-09-27 23:26:20,913 [myid:] - INFO  [NIOServerCxnFactory.SelectorThread-2:NIOServerCnxnFactory$SelectorThread@420]
- selector thread exitted run method
    [junit] 2017-09-27 23:26:21,003 [myid:] - INFO  [QuorumPeer[myid=5](plain=/127.0.0.1:16769)(secure=disabled):MBeanRegistry@128]
- Unregister MBean [org.apache.ZooKeeperService:name0=ReplicatedServer_id5,name1=replica.5,name2=Leader]
    [junit] 2017-09-27 23:26:21,003 [myid:] - INFO  [/127.0.0.1:16771:QuorumCnxManager$Listener@674]
- Leaving listener
    [junit] 2017-09-27 23:26:21,003 [myid:] - WARN  [QuorumPeer[myid=5](plain=/127.0.0.1:16769)(secure=disabled):QuorumPeer@1130]
- Unexpected exception
    [junit] java.lang.InterruptedException
    [junit] 	at java.lang.Object.wait(Native Method)
    [junit] 	at org.apache.zookeeper.server.quorum.Leader.lead(Leader.java:564)
    [junit] 	at org.apache.zookeeper.server.quorum.QuorumPeer.run(QuorumPeer.java:1127)
    [junit] 2017-09-27 23:26:21,004 [myid:] - INFO  [QuorumPeer[myid=5](plain=/127.0.0.1:16769)(secure=disabled):Leader@627]
- Shutting down
    [junit] 2017-09-27 23:26:21,004 [myid:] - WARN  [QuorumPeer[myid=5](plain=/127.0.0.1:16769)(secure=disabled):QuorumPeer@1161]
- PeerState set to LOOKING
    [junit] 2017-09-27 23:26:21,004 [myid:] - WARN  [QuorumPeer[myid=5](plain=/127.0.0.1:16769)(secure=disabled):QuorumPeer@1143]
- QuorumPeer main thread exited
    [junit] 2017-09-27 23:26:21,003 [myid:] - INFO  [main:QuorumUtil@254] - Shutting down
leader election QuorumPeer[myid=5](plain=/127.0.0.1:16769)(secure=disabled)
    [junit] 2017-09-27 23:26:21,004 [myid:] - INFO  [main:QuorumUtil@259] - Waiting for QuorumPeer[myid=5](plain=/127.0.0.1:16769)(secure=disabled)
to exit thread
    [junit] 2017-09-27 23:26:21,004 [myid:] - INFO  [QuorumPeer[myid=5](plain=/127.0.0.1:16769)(secure=disabled):MBeanRegistry@128]
- Unregister MBean [org.apache.ZooKeeperService:name0=ReplicatedServer_id5]
    [junit] 2017-09-27 23:26:21,004 [myid:] - INFO  [QuorumPeer[myid=5](plain=/127.0.0.1:16769)(secure=disabled):MBeanRegistry@128]
- Unregister MBean [org.apache.ZooKeeperService:name0=ReplicatedServer_id5,name1=replica.5]
    [junit] 2017-09-27 23:26:21,004 [myid:] - INFO  [QuorumPeer[myid=5](plain=/127.0.0.1:16769)(secure=disabled):MBeanRegistry@128]
- Unregister MBean [org.apache.ZooKeeperService:name0=ReplicatedServer_id5,name1=replica.1]
    [junit] 2017-09-27 23:26:21,004 [myid:] - INFO  [QuorumPeer[myid=5](plain=/127.0.0.1:16769)(secure=disabled):MBeanRegistry@128]
- Unregister MBean [org.apache.ZooKeeperService:name0=ReplicatedServer_id5,name1=replica.2]
    [junit] 2017-09-27 23:26:21,004 [myid:] - INFO  [QuorumPeer[myid=5](plain=/127.0.0.1:16769)(secure=disabled):MBeanRegistry@128]
- Unregister MBean [org.apache.ZooKeeperService:name0=ReplicatedServer_id5,name1=replica.3]
    [junit] 2017-09-27 23:26:21,004 [myid:] - INFO  [main:FourLetterWordMain@87] - connecting
to 127.0.0.1 16757
    [junit] 2017-09-27 23:26:21,005 [myid:] - INFO  [main:QuorumUtil@243] - 127.0.0.1:16757
is no longer accepting client connections
    [junit] 2017-09-27 23:26:21,005 [myid:] - INFO  [main:FourLetterWordMain@87] - connecting
to 127.0.0.1 16760
    [junit] 2017-09-27 23:26:21,005 [myid:] - INFO  [main:QuorumUtil@243] - 127.0.0.1:16760
is no longer accepting client connections
    [junit] 2017-09-27 23:26:21,005 [myid:] - INFO  [main:FourLetterWordMain@87] - connecting
to 127.0.0.1 16763
    [junit] 2017-09-27 23:26:21,005 [myid:] - INFO  [main:QuorumUtil@243] - 127.0.0.1:16763
is no longer accepting client connections
    [junit] 2017-09-27 23:26:21,006 [myid:] - INFO  [main:FourLetterWordMain@87] - connecting
to 127.0.0.1 16766
    [junit] 2017-09-27 23:26:21,006 [myid:] - INFO  [main:QuorumUtil@243] - 127.0.0.1:16766
is no longer accepting client connections
    [junit] 2017-09-27 23:26:21,006 [myid:] - INFO  [main:FourLetterWordMain@87] - connecting
to 127.0.0.1 16769
    [junit] 2017-09-27 23:26:21,006 [myid:] - INFO  [main:QuorumUtil@243] - 127.0.0.1:16769
is no longer accepting client connections
    [junit] 2017-09-27 23:26:21,008 [myid:] - INFO  [main:ZKTestCase$1@68] - SUCCEEDED testRemoveOneAsynchronous
    [junit] 2017-09-27 23:26:21,009 [myid:] - INFO  [main:ZKTestCase$1@63] - FINISHED testRemoveOneAsynchronous
    [junit] Tests run: 13, Failures: 0, Errors: 0, Skipped: 0, Time elapsed: 302.912 sec,
Thread: 3, Class: org.apache.zookeeper.test.ReconfigTest
    [junit] 2017-09-27 23:26:21,226 [myid:] - INFO  [SessionTracker:SessionTrackerImpl@158]
- SessionTrackerImpl exited loop!

fail.build.on.test.failure:

BUILD FAILED
/home/jenkins/jenkins-slave/workspace/ZooKeeper-trunk/build.xml:1339: The following error
occurred while executing this line:
/home/jenkins/jenkins-slave/workspace/ZooKeeper-trunk/build.xml:1220: The following error
occurred while executing this line:
/home/jenkins/jenkins-slave/workspace/ZooKeeper-trunk/build.xml:1224: Tests failed!

Total time: 9 minutes 45 seconds
Build step 'Execute shell' marked build as failure
[FINDBUGS] Skipping publisher since build result is FAILURE
[WARNINGS] Skipping publisher since build result is FAILURE
Archiving artifacts
Setting JDK_1_7_LATEST__HOME=/home/jenkins/tools/java/latest1.7
Recording fingerprints
Setting JDK_1_7_LATEST__HOME=/home/jenkins/tools/java/latest1.7
JIRA: Update relevant issues is waiting for a checkpoint on ZooKeeper-trunk #3551
Recording test results
Setting JDK_1_7_LATEST__HOME=/home/jenkins/tools/java/latest1.7
Publishing Javadoc
Setting JDK_1_7_LATEST__HOME=/home/jenkins/tools/java/latest1.7
Setting JDK_1_7_LATEST__HOME=/home/jenkins/tools/java/latest1.7
Email was triggered for: Failure - Any
Sending email for trigger: Failure - Any
Setting JDK_1_7_LATEST__HOME=/home/jenkins/tools/java/latest1.7
Setting JDK_1_7_LATEST__HOME=/home/jenkins/tools/java/latest1.7



###################################################################################
############################## FAILED TESTS (if any) ##############################
1 tests failed.
FAILED:  org.apache.zookeeper.server.quorum.ReconfigRecoveryTest.testCurrentServersAreObserversInNextConfig

Error Message:
waiting for server 3 being up

Stack Trace:
junit.framework.AssertionFailedError: waiting for server 3 being up
	at org.apache.zookeeper.server.quorum.ReconfigRecoveryTest.testCurrentServersAreObserversInNextConfig(ReconfigRecoveryTest.java:224)
	at org.apache.zookeeper.JUnit4ZKTestRunner$LoggedInvokeMethod.evaluate(JUnit4ZKTestRunner.java:79)
Mime
  • Unnamed multipart/mixed (inline, None, 0 bytes)
View raw message