zookeeper-dev mailing list archives

Site index · List index
Message view « Date » · « Thread »
Top « Date » · « Thread »
From Apache Jenkins Server <jenk...@builds.apache.org>
Subject Failed: ZOOKEEPER- PreCommit Build #1032
Date Fri, 22 Sep 2017 07:47:41 GMT
Build: https://builds.apache.org/job/PreCommit-ZOOKEEPER-github-pr-build/1032/

###################################################################################
########################## LAST 60 LINES OF THE CONSOLE ###########################
[...truncated 1.66 MB...]
     [exec] 
     [exec]     +1 javadoc.  The javadoc tool did not generate any warning messages.
     [exec] 
     [exec]     +1 javac.  The applied patch does not increase the total number of javac compiler
warnings.
     [exec] 
     [exec]     -1 findbugs.  The patch appears to introduce 3 new Findbugs (version 3.0.1)
warnings.
     [exec] 
     [exec]     -1 release audit.  The applied patch generated 1 release audit warnings (more
than the trunk's current 0 warnings).
     [exec] 
     [exec]     -1 core tests.  The patch failed core unit tests.
     [exec] 
     [exec]     +1 contrib tests.  The patch passed contrib unit tests.
     [exec] 
     [exec] Test results: https://builds.apache.org/job/PreCommit-ZOOKEEPER-github-pr-build/1032//testReport/
     [exec] Release audit warnings: https://builds.apache.org/job/PreCommit-ZOOKEEPER-github-pr-build/1032//artifact/trunk/patchprocess/patchReleaseAuditProblems.txt
     [exec] Findbugs warnings: https://builds.apache.org/job/PreCommit-ZOOKEEPER-github-pr-build/1032//artifact/trunk/build/test/findbugs/newPatchFindbugsWarnings.html
     [exec] Console output: https://builds.apache.org/job/PreCommit-ZOOKEEPER-github-pr-build/1032//console
     [exec] 
     [exec] This message is automatically generated.
     [exec] 
     [exec] 
     [exec] ======================================================================
     [exec] ======================================================================
     [exec]     Adding comment to Jira.
     [exec] ======================================================================
     [exec] ======================================================================
     [exec] 
     [exec] 
     [exec] Comment added.
     [exec] f899aa99931a9683bc0b814f780e60e28e9b1786 logged out
     [exec] 
     [exec] 
     [exec] ======================================================================
     [exec] ======================================================================
     [exec]     Finished build.
     [exec] ======================================================================
     [exec] ======================================================================
     [exec] 
     [exec] 
     [exec] mv: ‘/home/jenkins/jenkins-slave/workspace/PreCommit-ZOOKEEPER-github-pr-build/patchprocess’
and ‘/home/jenkins/jenkins-slave/workspace/PreCommit-ZOOKEEPER-github-pr-build/patchprocess’
are the same file

BUILD FAILED
/home/jenkins/jenkins-slave/workspace/PreCommit-ZOOKEEPER-github-pr-build/build.xml:1666:
exec returned: 3

Total time: 12 minutes 49 seconds
Build step 'Execute shell' marked build as failure
Archiving artifacts
Setting JDK_1_7_LATEST__HOME=/home/jenkins/tools/java/latest1.7
Recording test results
Setting JDK_1_7_LATEST__HOME=/home/jenkins/tools/java/latest1.7
Setting JDK_1_7_LATEST__HOME=/home/jenkins/tools/java/latest1.7
[description-setter] Description set: ZOOKEEPER-2770
Putting comment on the pull request
Setting JDK_1_7_LATEST__HOME=/home/jenkins/tools/java/latest1.7
Email was triggered for: Failure - Any
Sending email for trigger: Failure - Any
Setting JDK_1_7_LATEST__HOME=/home/jenkins/tools/java/latest1.7
Setting JDK_1_7_LATEST__HOME=/home/jenkins/tools/java/latest1.7
Setting JDK_1_7_LATEST__HOME=/home/jenkins/tools/java/latest1.7



###################################################################################
############################## FAILED TESTS (if any) ##############################
6 tests failed.
FAILED:  org.apache.zookeeper.server.HighLatencyRequestLoggingTest.testSingleThreadFrequentRequestWarningThresholdLogging

Error Message:

Wanted but not invoked:
mockAppender.doAppend(<Capturing argument>);
-> at org.apache.zookeeper.server.HighLatencyRequestLoggingTest.testSingleThreadFrequentRequestWarningThresholdLogging(HighLatencyRequestLoggingTest.java:155)

However, there were other interactions with this mock:
mockAppender.getName();
-> at org.apache.log4j.jmx.HierarchyDynamicMBean.addAppenderEvent(HierarchyDynamicMBean.java:244)

mockAppender.getName();
-> at org.apache.log4j.jmx.AbstractDynamicMBean.getAppenderName(AbstractDynamicMBean.java:54)



Stack Trace:
junit.framework.AssertionFailedError: 
Wanted but not invoked:
mockAppender.doAppend(<Capturing argument>);
-> at org.apache.zookeeper.server.HighLatencyRequestLoggingTest.testSingleThreadFrequentRequestWarningThresholdLogging(HighLatencyRequestLoggingTest.java:155)

However, there were other interactions with this mock:
mockAppender.getName();
-> at org.apache.log4j.jmx.HierarchyDynamicMBean.addAppenderEvent(HierarchyDynamicMBean.java:244)

mockAppender.getName();
-> at org.apache.log4j.jmx.AbstractDynamicMBean.getAppenderName(AbstractDynamicMBean.java:54)


	at org.apache.zookeeper.server.HighLatencyRequestLoggingTest.testSingleThreadFrequentRequestWarningThresholdLogging(HighLatencyRequestLoggingTest.java:155)
	at org.mockito.internal.runners.JUnit45AndHigherRunnerImpl.run(JUnit45AndHigherRunnerImpl.java:37)
	at org.mockito.runners.MockitoJUnitRunner.run(MockitoJUnitRunner.java:62)


FAILED:  org.apache.zookeeper.server.HighLatencyRequestLoggingTest.testMultipleThreadsFrequentRequestWarningThresholdLogging

Error Message:

Wanted but not invoked:
mockAppender.doAppend(<Capturing argument>);
-> at org.apache.zookeeper.server.HighLatencyRequestLoggingTest.testMultipleThreadsFrequentRequestWarningThresholdLogging(HighLatencyRequestLoggingTest.java:214)

However, there were other interactions with this mock:
mockAppender.getName();
-> at org.apache.log4j.jmx.HierarchyDynamicMBean.addAppenderEvent(HierarchyDynamicMBean.java:244)

mockAppender.getName();
-> at org.apache.log4j.jmx.AbstractDynamicMBean.getAppenderName(AbstractDynamicMBean.java:54)

mockAppender.getName();
-> at org.apache.log4j.jmx.HierarchyDynamicMBean.addAppenderEvent(HierarchyDynamicMBean.java:244)



Stack Trace:
junit.framework.AssertionFailedError: 
Wanted but not invoked:
mockAppender.doAppend(<Capturing argument>);
-> at org.apache.zookeeper.server.HighLatencyRequestLoggingTest.testMultipleThreadsFrequentRequestWarningThresholdLogging(HighLatencyRequestLoggingTest.java:214)

However, there were other interactions with this mock:
mockAppender.getName();
-> at org.apache.log4j.jmx.HierarchyDynamicMBean.addAppenderEvent(HierarchyDynamicMBean.java:244)

mockAppender.getName();
-> at org.apache.log4j.jmx.AbstractDynamicMBean.getAppenderName(AbstractDynamicMBean.java:54)

mockAppender.getName();
-> at org.apache.log4j.jmx.HierarchyDynamicMBean.addAppenderEvent(HierarchyDynamicMBean.java:244)


	at org.apache.zookeeper.server.HighLatencyRequestLoggingTest.testMultipleThreadsFrequentRequestWarningThresholdLogging(HighLatencyRequestLoggingTest.java:214)
	at org.mockito.internal.runners.JUnit45AndHigherRunnerImpl.run(JUnit45AndHigherRunnerImpl.java:37)
	at org.mockito.runners.MockitoJUnitRunner.run(MockitoJUnitRunner.java:62)


FAILED:  org.apache.zookeeper.server.quorum.QuorumPeerMainTest.testInconsistentPeerType

Error Message:
Should warn about inconsistent peer type

Stack Trace:
junit.framework.AssertionFailedError: Should warn about inconsistent peer type
	at org.apache.zookeeper.server.quorum.QuorumPeerMainTest.testInconsistentPeerType(QuorumPeerMainTest.java:551)
	at org.apache.zookeeper.JUnit4ZKTestRunner$LoggedInvokeMethod.evaluate(JUnit4ZKTestRunner.java:79)


FAILED:  org.apache.zookeeper.server.quorum.QuorumPeerMainTest.testQuorumDefaults

Error Message:
fastleaderelection used

Stack Trace:
junit.framework.AssertionFailedError: fastleaderelection used
	at org.apache.zookeeper.server.quorum.QuorumPeerMainTest.testQuorumDefaults(QuorumPeerMainTest.java:674)
	at org.apache.zookeeper.JUnit4ZKTestRunner$LoggedInvokeMethod.evaluate(JUnit4ZKTestRunner.java:79)


FAILED:  org.apache.zookeeper.server.quorum.QuorumPeerMainTest.testBadPeerAddressInQuorum

Error Message:
complains about host

Stack Trace:
junit.framework.AssertionFailedError: complains about host
	at org.apache.zookeeper.server.quorum.QuorumPeerMainTest.testBadPeerAddressInQuorum(QuorumPeerMainTest.java:464)
	at org.apache.zookeeper.JUnit4ZKTestRunner$LoggedInvokeMethod.evaluate(JUnit4ZKTestRunner.java:79)


FAILED:  org.apache.zookeeper.test.ReadOnlyModeTest.testSeekForRwServer

Error Message:
Majority server wasn't found while connected to r/o server

Stack Trace:
junit.framework.AssertionFailedError: Majority server wasn't found while connected to r/o
server
	at org.apache.zookeeper.test.ReadOnlyModeTest.testSeekForRwServer(ReadOnlyModeTest.java:305)
	at org.apache.zookeeper.JUnit4ZKTestRunner$LoggedInvokeMethod.evaluate(JUnit4ZKTestRunner.java:79)
	at java.util.concurrent.FutureTask.run(FutureTask.java:262)
	at java.lang.Thread.run(Thread.java:745)
Mime
  • Unnamed multipart/mixed (inline, None, 0 bytes)
View raw message