zookeeper-dev mailing list archives

Site index · List index
Message view « Date » · « Thread »
Top « Date » · « Thread »
From Apache Jenkins Server <jenk...@builds.apache.org>
Subject ZooKeeper-trunk-jdk8 - Build # 1170 - Failure
Date Sat, 19 Aug 2017 00:23:27 GMT
See https://builds.apache.org/job/ZooKeeper-trunk-jdk8/1170/

###################################################################################
########################## LAST 60 LINES OF THE CONSOLE ###########################
[...truncated 65.52 MB...]
    [junit] 	at org.jboss.netty.channel.socket.nio.NioWorker.read(NioWorker.java:93)
    [junit] 	at org.jboss.netty.channel.socket.nio.AbstractNioWorker.process(AbstractNioWorker.java:108)
    [junit] 	at org.jboss.netty.channel.socket.nio.AbstractNioSelector.run(AbstractNioSelector.java:337)
    [junit] 	at org.jboss.netty.channel.socket.nio.AbstractNioWorker.run(AbstractNioWorker.java:89)
    [junit] 	at org.jboss.netty.channel.socket.nio.NioWorker.run(NioWorker.java:178)
    [junit] 	at org.jboss.netty.util.ThreadRenamingRunnable.run(ThreadRenamingRunnable.java:108)
    [junit] 	at org.jboss.netty.util.internal.DeadLockProofWorker$1.run(DeadLockProofWorker.java:42)
    [junit] 	at java.util.concurrent.ThreadPoolExecutor.runWorker(ThreadPoolExecutor.java:1149)
    [junit] 	at java.util.concurrent.ThreadPoolExecutor$Worker.run(ThreadPoolExecutor.java:624)
    [junit] 	at java.lang.Thread.run(Thread.java:748)
    [junit] 2017-08-19 00:23:25,400 [myid:] - INFO  [main:JUnit4ZKTestRunner$LoggedInvokeMethod@82]
- Memory used 89649
    [junit] 2017-08-19 00:23:25,400 [myid:] - INFO  [main:JUnit4ZKTestRunner$LoggedInvokeMethod@87]
- Number of threads 863
    [junit] 2017-08-19 00:23:25,400 [myid:] - INFO  [main:JUnit4ZKTestRunner$LoggedInvokeMethod@102]
- FINISHED TEST METHOD testWatcherAutoResetWithLocal
    [junit] 2017-08-19 00:23:25,400 [myid:] - INFO  [main:ClientBase@601] - tearDown starting
    [junit] 2017-08-19 00:23:25,401 [myid:] - INFO  [main:ClientBase@571] - STOPPING server
    [junit] 2017-08-19 00:23:25,401 [myid:] - INFO  [main:NettyServerCnxnFactory@464] - shutdown
called 0.0.0.0/0.0.0.0:11468
    [junit] 2017-08-19 00:23:25,402 [myid:] - INFO  [main:ZooKeeperServer@545] - shutting
down
    [junit] 2017-08-19 00:23:25,402 [myid:] - ERROR [main:ZooKeeperServer@509] - ZKShutdownHandler
is not registered, so ZooKeeper server won't take any action on ERROR or SHUTDOWN server state
changes
    [junit] 2017-08-19 00:23:25,402 [myid:] - INFO  [main:SessionTrackerImpl@232] - Shutting
down
    [junit] 2017-08-19 00:23:25,403 [myid:] - INFO  [main:PrepRequestProcessor@1010] - Shutting
down
    [junit] 2017-08-19 00:23:25,403 [myid:] - INFO  [main:SyncRequestProcessor@191] - Shutting
down
    [junit] 2017-08-19 00:23:25,403 [myid:] - INFO  [ProcessThread(sid:0 cport:11468)::PrepRequestProcessor@155]
- PrepRequestProcessor exited loop!
    [junit] 2017-08-19 00:23:25,403 [myid:] - INFO  [SyncThread:0:SyncRequestProcessor@169]
- SyncRequestProcessor exited!
    [junit] 2017-08-19 00:23:25,403 [myid:] - INFO  [main:FinalRequestProcessor@481] - shutdown
of request processor complete
    [junit] 2017-08-19 00:23:25,403 [myid:] - INFO  [main:MBeanRegistry@128] - Unregister
MBean [org.apache.ZooKeeperService:name0=StandaloneServer_port11468,name1=InMemoryDataTree]
    [junit] 2017-08-19 00:23:25,404 [myid:] - INFO  [main:MBeanRegistry@128] - Unregister
MBean [org.apache.ZooKeeperService:name0=StandaloneServer_port11468]
    [junit] 2017-08-19 00:23:25,404 [myid:] - INFO  [main:FourLetterWordMain@87] - connecting
to 127.0.0.1 11468
    [junit] 2017-08-19 00:23:25,404 [myid:] - INFO  [main:JMXEnv@146] - ensureOnly:[]
    [junit] 2017-08-19 00:23:25,413 [myid:] - INFO  [main:ClientBase@626] - fdcount after
test is: 2550 at start it was 2558
    [junit] 2017-08-19 00:23:25,413 [myid:] - INFO  [main:ZKTestCase$1@68] - SUCCEEDED testWatcherAutoResetWithLocal
    [junit] 2017-08-19 00:23:25,464 [myid:] - INFO  [main:ZKTestCase$1@63] - FINISHED testWatcherAutoResetWithLocal
    [junit] Tests run: 105, Failures: 0, Errors: 0, Skipped: 0, Time elapsed: 435.574 sec,
Thread: 1, Class: org.apache.zookeeper.test.NioNettySuiteTest
    [junit] 2017-08-19 00:23:25,806 [myid:127.0.0.1:11222] - INFO  [main-SendThread(127.0.0.1:11222):ClientCnxn$SendThread@1113]
- Opening socket connection to server 127.0.0.1/127.0.0.1:11222. Will not attempt to authenticate
using SASL (unknown error)
    [junit] 2017-08-19 00:23:25,806 [myid:127.0.0.1:11222] - WARN  [main-SendThread(127.0.0.1:11222):ClientCnxn$SendThread@1235]
- Session 0x105714a676f0000 for server 127.0.0.1/127.0.0.1:11222, unexpected error, closing
socket connection and attempting reconnect
    [junit] java.net.ConnectException: Connection refused
    [junit] 	at sun.nio.ch.SocketChannelImpl.checkConnect(Native Method)
    [junit] 	at sun.nio.ch.SocketChannelImpl.finishConnect(SocketChannelImpl.java:717)
    [junit] 	at org.apache.zookeeper.ClientCnxnSocketNIO.doTransport(ClientCnxnSocketNIO.java:357)
    [junit] 	at org.apache.zookeeper.ClientCnxn$SendThread.run(ClientCnxn.java:1214)
    [junit] 2017-08-19 00:23:25,819 [myid:127.0.0.1:11348] - INFO  [main-SendThread(127.0.0.1:11348):ClientCnxn$SendThread@1113]
- Opening socket connection to server 127.0.0.1/127.0.0.1:11348. Will not attempt to authenticate
using SASL (unknown error)
    [junit] 2017-08-19 00:23:25,819 [myid:127.0.0.1:11348] - WARN  [main-SendThread(127.0.0.1:11348):ClientCnxn$SendThread@1235]
- Session 0x205714d74660000 for server 127.0.0.1/127.0.0.1:11348, unexpected error, closing
socket connection and attempting reconnect
    [junit] java.net.ConnectException: Connection refused
    [junit] 	at sun.nio.ch.SocketChannelImpl.checkConnect(Native Method)
    [junit] 	at sun.nio.ch.SocketChannelImpl.finishConnect(SocketChannelImpl.java:717)
    [junit] 	at org.apache.zookeeper.ClientCnxnSocketNIO.doTransport(ClientCnxnSocketNIO.java:357)
    [junit] 	at org.apache.zookeeper.ClientCnxn$SendThread.run(ClientCnxn.java:1214)

fail.build.on.test.failure:

BUILD FAILED
/home/jenkins/jenkins-slave/workspace/ZooKeeper-trunk-jdk8/build.xml:1220: The following error
occurred while executing this line:
/home/jenkins/jenkins-slave/workspace/ZooKeeper-trunk-jdk8/build.xml:1224: Tests failed!

Total time: 11 minutes 26 seconds
Build step 'Invoke Ant' marked build as failure
[WARNINGS] Skipping publisher since build result is FAILURE
Recording test results
Email was triggered for: Failure - Any
Sending email for trigger: Failure - Any



###################################################################################
############################## FAILED TESTS (if any) ##############################
2 tests failed.
FAILED:  org.apache.zookeeper.test.FourLetterWordsTest.testFourLetterWords

Error Message:
Exception while executing four letter word: dump

Stack Trace:
java.io.IOException: Exception while executing four letter word: dump
	at org.apache.zookeeper.client.FourLetterWordMain.send4LetterWord(FourLetterWordMain.java:126)
	at org.apache.zookeeper.client.FourLetterWordMain.send4LetterWord(FourLetterWordMain.java:56)
	at org.apache.zookeeper.test.FourLetterWordsTest.sendRequest(FourLetterWordsTest.java:120)
	at org.apache.zookeeper.test.FourLetterWordsTest.verify(FourLetterWordsTest.java:128)
	at org.apache.zookeeper.test.FourLetterWordsTest.testFourLetterWords(FourLetterWordsTest.java:100)
	at org.apache.zookeeper.JUnit4ZKTestRunner$LoggedInvokeMethod.evaluate(JUnit4ZKTestRunner.java:79)
	at java.util.concurrent.FutureTask.run(FutureTask.java:266)
	at java.lang.Thread.run(Thread.java:748)
Caused by: java.net.SocketTimeoutException: Read timed out
	at java.net.SocketInputStream.socketRead0(Native Method)
	at java.net.SocketInputStream.socketRead(SocketInputStream.java:116)
	at java.net.SocketInputStream.read(SocketInputStream.java:171)
	at java.net.SocketInputStream.read(SocketInputStream.java:141)
	at sun.nio.cs.StreamDecoder.readBytes(StreamDecoder.java:284)
	at sun.nio.cs.StreamDecoder.implRead(StreamDecoder.java:326)
	at sun.nio.cs.StreamDecoder.read(StreamDecoder.java:178)
	at java.io.InputStreamReader.read(InputStreamReader.java:184)
	at java.io.BufferedReader.fill(BufferedReader.java:161)
	at java.io.BufferedReader.readLine(BufferedReader.java:324)
	at java.io.BufferedReader.readLine(BufferedReader.java:389)
	at org.apache.zookeeper.client.FourLetterWordMain.send4LetterWord(FourLetterWordMain.java:121)


FAILED:  org.apache.zookeeper.test.WatchEventWhenAutoResetTest.testNodeDataChanged

Error Message:
expected:<NodeDataChanged> but was:<NodeDeleted>

Stack Trace:
junit.framework.AssertionFailedError: expected:<NodeDataChanged> but was:<NodeDeleted>
	at org.apache.zookeeper.test.WatchEventWhenAutoResetTest$EventsWatcher.assertEvent(WatchEventWhenAutoResetTest.java:67)
	at org.apache.zookeeper.test.WatchEventWhenAutoResetTest.testNodeDataChanged(WatchEventWhenAutoResetTest.java:117)
	at org.apache.zookeeper.JUnit4ZKTestRunner$LoggedInvokeMethod.evaluate(JUnit4ZKTestRunner.java:79)
Mime
  • Unnamed multipart/mixed (inline, None, 0 bytes)
View raw message