zookeeper-dev mailing list archives

Site index · List index
Message view « Date » · « Thread »
Top « Date » · « Thread »
From Apache Jenkins Server <jenk...@builds.apache.org>
Subject ZooKeeper-trunk - Build # 3493 - Still Failing
Date Thu, 10 Aug 2017 20:35:14 GMT
See https://builds.apache.org/job/ZooKeeper-trunk/3493/

###################################################################################
########################## LAST 60 LINES OF THE CONSOLE ###########################
[...truncated 65.38 MB...]
    [junit] 	at org.jboss.netty.channel.socket.nio.NioWorker.read(NioWorker.java:93)
    [junit] 	at org.jboss.netty.channel.socket.nio.AbstractNioWorker.process(AbstractNioWorker.java:108)
    [junit] 	at org.jboss.netty.channel.socket.nio.AbstractNioSelector.run(AbstractNioSelector.java:337)
    [junit] 	at org.jboss.netty.channel.socket.nio.AbstractNioWorker.run(AbstractNioWorker.java:89)
    [junit] 	at org.jboss.netty.channel.socket.nio.NioWorker.run(NioWorker.java:178)
    [junit] 	at org.jboss.netty.util.ThreadRenamingRunnable.run(ThreadRenamingRunnable.java:108)
    [junit] 	at org.jboss.netty.util.internal.DeadLockProofWorker$1.run(DeadLockProofWorker.java:42)
    [junit] 	at java.util.concurrent.ThreadPoolExecutor.runWorker(ThreadPoolExecutor.java:1145)
    [junit] 	at java.util.concurrent.ThreadPoolExecutor$Worker.run(ThreadPoolExecutor.java:615)
    [junit] 	at java.lang.Thread.run(Thread.java:745)
    [junit] 2017-08-10 20:34:54,495 [myid:] - INFO  [main:JUnit4ZKTestRunner$LoggedInvokeMethod@82]
- Memory used 172280
    [junit] 2017-08-10 20:34:54,495 [myid:] - INFO  [main:JUnit4ZKTestRunner$LoggedInvokeMethod@87]
- Number of threads 1647
    [junit] 2017-08-10 20:34:54,496 [myid:] - INFO  [main:JUnit4ZKTestRunner$LoggedInvokeMethod@102]
- FINISHED TEST METHOD testWatcherAutoResetWithLocal
    [junit] 2017-08-10 20:34:54,496 [myid:] - INFO  [main:ClientBase@601] - tearDown starting
    [junit] 2017-08-10 20:34:54,496 [myid:] - INFO  [main:ClientBase@571] - STOPPING server
    [junit] 2017-08-10 20:34:54,496 [myid:] - INFO  [main:NettyServerCnxnFactory@464] - shutdown
called 0.0.0.0/0.0.0.0:27626
    [junit] 2017-08-10 20:34:54,502 [myid:] - INFO  [main:ZooKeeperServer@541] - shutting
down
    [junit] 2017-08-10 20:34:54,502 [myid:] - ERROR [main:ZooKeeperServer@505] - ZKShutdownHandler
is not registered, so ZooKeeper server won't take any action on ERROR or SHUTDOWN server state
changes
    [junit] 2017-08-10 20:34:54,502 [myid:] - INFO  [main:SessionTrackerImpl@232] - Shutting
down
    [junit] 2017-08-10 20:34:54,503 [myid:] - INFO  [main:PrepRequestProcessor@1008] - Shutting
down
    [junit] 2017-08-10 20:34:54,503 [myid:] - INFO  [main:SyncRequestProcessor@191] - Shutting
down
    [junit] 2017-08-10 20:34:54,503 [myid:] - INFO  [ProcessThread(sid:0 cport:27626)::PrepRequestProcessor@155]
- PrepRequestProcessor exited loop!
    [junit] 2017-08-10 20:34:54,503 [myid:] - INFO  [SyncThread:0:SyncRequestProcessor@169]
- SyncRequestProcessor exited!
    [junit] 2017-08-10 20:34:54,509 [myid:] - INFO  [main:FinalRequestProcessor@481] - shutdown
of request processor complete
    [junit] 2017-08-10 20:34:54,509 [myid:] - INFO  [main:MBeanRegistry@128] - Unregister
MBean [org.apache.ZooKeeperService:name0=StandaloneServer_port27626,name1=InMemoryDataTree]
    [junit] 2017-08-10 20:34:54,509 [myid:] - INFO  [main:MBeanRegistry@128] - Unregister
MBean [org.apache.ZooKeeperService:name0=StandaloneServer_port27626]
    [junit] 2017-08-10 20:34:54,509 [myid:] - INFO  [main:FourLetterWordMain@87] - connecting
to 127.0.0.1 27626
    [junit] 2017-08-10 20:34:54,510 [myid:] - INFO  [main:JMXEnv@146] - ensureOnly:[]
    [junit] 2017-08-10 20:34:54,515 [myid:] - INFO  [main:ClientBase@626] - fdcount after
test is: 4838 at start it was 4838
    [junit] 2017-08-10 20:34:54,515 [myid:] - INFO  [main:ZKTestCase$1@68] - SUCCEEDED testWatcherAutoResetWithLocal
    [junit] 2017-08-10 20:34:54,515 [myid:] - INFO  [main:ZKTestCase$1@63] - FINISHED testWatcherAutoResetWithLocal
    [junit] Tests run: 103, Failures: 0, Errors: 0, Skipped: 0, Time elapsed: 416.296 sec,
Thread: 7, Class: org.apache.zookeeper.test.NioNettySuiteTest

fail.build.on.test.failure:

BUILD FAILED
/home/jenkins/jenkins-slave/workspace/ZooKeeper-trunk/build.xml:1339: The following error
occurred while executing this line:
/home/jenkins/jenkins-slave/workspace/ZooKeeper-trunk/build.xml:1220: The following error
occurred while executing this line:
/home/jenkins/jenkins-slave/workspace/ZooKeeper-trunk/build.xml:1224: Tests failed!

Total time: 10 minutes 4 seconds
Build step 'Execute shell' marked build as failure
[FINDBUGS] Skipping publisher since build result is FAILURE
[WARNINGS] Skipping publisher since build result is FAILURE
Archiving artifacts
Setting JDK_1_7_LATEST__HOME=/home/jenkins/tools/java/latest1.7
Recording fingerprints
Setting JDK_1_7_LATEST__HOME=/home/jenkins/tools/java/latest1.7
[JIRA] Updating issue ZOOKEEPER-2864
[JIRA] Updating issue ZOOKEEPER-2870
Recording test results
Setting JDK_1_7_LATEST__HOME=/home/jenkins/tools/java/latest1.7
Publishing Javadoc
Setting JDK_1_7_LATEST__HOME=/home/jenkins/tools/java/latest1.7
Setting JDK_1_7_LATEST__HOME=/home/jenkins/tools/java/latest1.7
Email was triggered for: Failure - Any
Sending email for trigger: Failure - Any
Setting JDK_1_7_LATEST__HOME=/home/jenkins/tools/java/latest1.7
Setting JDK_1_7_LATEST__HOME=/home/jenkins/tools/java/latest1.7



###################################################################################
############################## FAILED TESTS (if any) ##############################
1 tests failed.
FAILED:  org.apache.zookeeper.test.NonRecoverableErrorTest.testZooKeeperServiceAvailableOnLeader

Error Message:
IOException is expected due to error injected to transaction log commit

Stack Trace:
junit.framework.AssertionFailedError: IOException is expected due to error injected to transaction
log commit
	at org.apache.zookeeper.test.NonRecoverableErrorTest.testZooKeeperServiceAvailableOnLeader(NonRecoverableErrorTest.java:115)
	at org.apache.zookeeper.JUnit4ZKTestRunner$LoggedInvokeMethod.evaluate(JUnit4ZKTestRunner.java:79)
	at java.util.concurrent.FutureTask.run(FutureTask.java:262)
	at java.lang.Thread.run(Thread.java:745)
Mime
  • Unnamed multipart/mixed (inline, None, 0 bytes)
View raw message