zookeeper-dev mailing list archives

Site index · List index
Message view « Date » · « Thread »
Top « Date » · « Thread »
From Apache Jenkins Server <jenk...@builds.apache.org>
Subject ZooKeeper_branch34_jdk8 - Build # 1105 - Failure
Date Thu, 24 Aug 2017 01:56:08 GMT
See https://builds.apache.org/job/ZooKeeper_branch34_jdk8/1105/

###################################################################################
########################## LAST 60 LINES OF THE CONSOLE ###########################
[...truncated 32.33 MB...]
    [junit] 2017-08-24 01:56:04,769 [myid:] - INFO  [main:PrepRequestProcessor@769] - Shutting
down
    [junit] 2017-08-24 01:56:04,769 [myid:] - INFO  [main:SyncRequestProcessor@208] - Shutting
down
    [junit] 2017-08-24 01:56:04,769 [myid:] - INFO  [ProcessThread(sid:0 cport:11221)::PrepRequestProcessor@144]
- PrepRequestProcessor exited loop!
    [junit] 2017-08-24 01:56:04,769 [myid:] - INFO  [SyncThread:0:SyncRequestProcessor@186]
- SyncRequestProcessor exited!
    [junit] 2017-08-24 01:56:04,770 [myid:] - INFO  [main:FinalRequestProcessor@403] - shutdown
of request processor complete
    [junit] 2017-08-24 01:56:04,770 [myid:] - INFO  [main:FourLetterWordMain@65] - connecting
to 127.0.0.1 11221
    [junit] 2017-08-24 01:56:04,771 [myid:] - INFO  [main:JMXEnv@147] - ensureOnly:[]
    [junit] 2017-08-24 01:56:04,772 [myid:] - INFO  [main:ClientBase@489] - STARTING server
    [junit] 2017-08-24 01:56:04,772 [myid:] - INFO  [main:ClientBase@410] - CREATING server
instance 127.0.0.1:11221
    [junit] 2017-08-24 01:56:04,773 [myid:] - INFO  [main:ServerCnxnFactory@116] - Using org.apache.zookeeper.server.NIOServerCnxnFactory
as server connection factory
    [junit] 2017-08-24 01:56:04,773 [myid:] - INFO  [main:NIOServerCnxnFactory@89] - binding
to port 0.0.0.0/0.0.0.0:11221
    [junit] 2017-08-24 01:56:04,773 [myid:] - INFO  [main:ClientBase@385] - STARTING server
instance 127.0.0.1:11221
    [junit] 2017-08-24 01:56:04,774 [myid:] - INFO  [main:ZooKeeperServer@173] - Created server
with tickTime 3000 minSessionTimeout 6000 maxSessionTimeout 60000 datadir /home/jenkins/jenkins-slave/workspace/ZooKeeper_branch34_jdk8/build/test/tmp/test2833130142638476348.junit.dir/version-2
snapdir /home/jenkins/jenkins-slave/workspace/ZooKeeper_branch34_jdk8/build/test/tmp/test2833130142638476348.junit.dir/version-2
    [junit] 2017-08-24 01:56:04,777 [myid:] - ERROR [main:ZooKeeperServer@468] - ZKShutdownHandler
is not registered, so ZooKeeper server won't take any action on ERROR or SHUTDOWN server state
changes
    [junit] 2017-08-24 01:56:04,777 [myid:] - INFO  [main:FourLetterWordMain@65] - connecting
to 127.0.0.1 11221
    [junit] 2017-08-24 01:56:04,778 [myid:] - INFO  [NIOServerCxn.Factory:0.0.0.0/0.0.0.0:11221:NIOServerCnxnFactory@215]
- Accepted socket connection from /127.0.0.1:59776
    [junit] 2017-08-24 01:56:04,778 [myid:] - INFO  [NIOServerCxn.Factory:0.0.0.0/0.0.0.0:11221:NIOServerCnxn@892]
- Processing stat command from /127.0.0.1:59776
    [junit] 2017-08-24 01:56:04,779 [myid:] - INFO  [Thread-4:NIOServerCnxn$StatCommand@683]
- Stat command output
    [junit] 2017-08-24 01:56:04,779 [myid:] - INFO  [Thread-4:NIOServerCnxn@1040] - Closed
socket connection for client /127.0.0.1:59776 (no session established for client)
    [junit] 2017-08-24 01:56:04,779 [myid:] - INFO  [main:JMXEnv@230] - ensureParent:[InMemoryDataTree,
StandaloneServer_port]
    [junit] 2017-08-24 01:56:04,781 [myid:] - INFO  [main:JMXEnv@247] - expect:InMemoryDataTree
    [junit] 2017-08-24 01:56:04,781 [myid:] - INFO  [main:JMXEnv@251] - found:InMemoryDataTree
org.apache.ZooKeeperService:name0=StandaloneServer_port11221,name1=InMemoryDataTree
    [junit] 2017-08-24 01:56:04,782 [myid:] - INFO  [main:JMXEnv@247] - expect:StandaloneServer_port
    [junit] 2017-08-24 01:56:04,782 [myid:] - INFO  [main:JMXEnv@251] - found:StandaloneServer_port
org.apache.ZooKeeperService:name0=StandaloneServer_port11221
    [junit] 2017-08-24 01:56:04,782 [myid:] - INFO  [main:JUnit4ZKTestRunner$LoggedInvokeMethod@58]
- Memory used 35555
    [junit] 2017-08-24 01:56:04,783 [myid:] - INFO  [main:JUnit4ZKTestRunner$LoggedInvokeMethod@63]
- Number of threads 20
    [junit] 2017-08-24 01:56:04,783 [myid:] - INFO  [main:JUnit4ZKTestRunner$LoggedInvokeMethod@78]
- FINISHED TEST METHOD testQuota
    [junit] 2017-08-24 01:56:04,783 [myid:] - INFO  [main:ClientBase@566] - tearDown starting
    [junit] 2017-08-24 01:56:04,851 [myid:] - INFO  [main:ZooKeeper@687] - Session: 0x103d81200260000
closed
    [junit] 2017-08-24 01:56:04,851 [myid:] - INFO  [main:ClientBase@536] - STOPPING server
    [junit] 2017-08-24 01:56:04,851 [myid:] - INFO  [main-EventThread:ClientCnxn$EventThread@520]
- EventThread shut down for session: 0x103d81200260000
    [junit] 2017-08-24 01:56:04,851 [myid:] - INFO  [NIOServerCxn.Factory:0.0.0.0/0.0.0.0:11221:NIOServerCnxnFactory@242]
- NIOServerCnxn factory exited run method
    [junit] 2017-08-24 01:56:04,852 [myid:] - INFO  [main:ZooKeeperServer@501] - shutting
down
    [junit] 2017-08-24 01:56:04,852 [myid:] - ERROR [main:ZooKeeperServer@468] - ZKShutdownHandler
is not registered, so ZooKeeper server won't take any action on ERROR or SHUTDOWN server state
changes
    [junit] 2017-08-24 01:56:04,852 [myid:] - INFO  [main:SessionTrackerImpl@226] - Shutting
down
    [junit] 2017-08-24 01:56:04,852 [myid:] - INFO  [main:PrepRequestProcessor@769] - Shutting
down
    [junit] 2017-08-24 01:56:04,852 [myid:] - INFO  [main:SyncRequestProcessor@208] - Shutting
down
    [junit] 2017-08-24 01:56:04,852 [myid:] - INFO  [ProcessThread(sid:0 cport:11221)::PrepRequestProcessor@144]
- PrepRequestProcessor exited loop!
    [junit] 2017-08-24 01:56:04,853 [myid:] - INFO  [SyncThread:0:SyncRequestProcessor@186]
- SyncRequestProcessor exited!
    [junit] 2017-08-24 01:56:04,853 [myid:] - INFO  [main:FinalRequestProcessor@403] - shutdown
of request processor complete
    [junit] 2017-08-24 01:56:04,854 [myid:] - INFO  [main:FourLetterWordMain@65] - connecting
to 127.0.0.1 11221
    [junit] 2017-08-24 01:56:04,854 [myid:] - INFO  [main:JMXEnv@147] - ensureOnly:[]
    [junit] 2017-08-24 01:56:04,859 [myid:] - INFO  [main:ClientBase@591] - fdcount after
test is: 99 at start it was 81
    [junit] 2017-08-24 01:56:04,859 [myid:] - INFO  [main:ClientBase@593] - sleeping for 20
secs
    [junit] 2017-08-24 01:56:04,860 [myid:] - INFO  [main:ZKTestCase$1@69] - SUCCEEDED testQuota
    [junit] 2017-08-24 01:56:04,860 [myid:] - INFO  [main:ZKTestCase$1@64] - FINISHED testQuota
    [junit] Tests run: 1, Failures: 0, Errors: 0, Skipped: 0, Time elapsed: 0.694 sec

fail.build.on.test.failure:

BUILD FAILED
/home/jenkins/jenkins-slave/workspace/ZooKeeper_branch34_jdk8/build.xml:1333: The following
error occurred while executing this line:
/home/jenkins/jenkins-slave/workspace/ZooKeeper_branch34_jdk8/build.xml:1336: Tests failed!

Total time: 41 minutes 57 seconds
Build step 'Invoke Ant' marked build as failure
Recording test results
Email was triggered for: Failure - Any
Sending email for trigger: Failure - Any



###################################################################################
############################## FAILED TESTS (if any) ##############################
1 tests failed.
FAILED:  org.apache.zookeeper.test.FollowerTest.testNoLogBeforeLeaderEstablishment

Error Message:
Forked Java VM exited abnormally. Please note the time in the report does not reflect the
time until the VM exit.

Stack Trace:
junit.framework.AssertionFailedError: Forked Java VM exited abnormally. Please note the time
in the report does not reflect the time until the VM exit.
Mime
  • Unnamed multipart/mixed (inline, None, 0 bytes)
View raw message