zookeeper-dev mailing list archives

Site index · List index
Message view « Date » · « Thread »
Top « Date » · « Thread »
From Apache Jenkins Server <jenk...@builds.apache.org>
Subject ZooKeeper-trunk-jdk8 - Build # 1136 - Failure
Date Fri, 21 Jul 2017 19:12:50 GMT
See https://builds.apache.org/job/ZooKeeper-trunk-jdk8/1136/

###################################################################################
########################## LAST 60 LINES OF THE CONSOLE ###########################
[...truncated 64.42 MB...]
    [junit] 	at sun.nio.ch.SocketChannelImpl.finishConnect(SocketChannelImpl.java:717)
    [junit] 	at org.apache.zookeeper.ClientCnxnSocketNIO.doTransport(ClientCnxnSocketNIO.java:357)
    [junit] 	at org.apache.zookeeper.ClientCnxn$SendThread.run(ClientCnxn.java:1214)
    [junit] 2017-07-21 19:06:40,180 [myid:127.0.0.1:27509] - INFO  [main-SendThread(127.0.0.1:27509):ClientCnxn$SendThread@1113]
- Opening socket connection to server 127.0.0.1/127.0.0.1:27509. Will not attempt to authenticate
using SASL (unknown error)
    [junit] 2017-07-21 19:06:40,181 [myid:127.0.0.1:27509] - WARN  [main-SendThread(127.0.0.1:27509):ClientCnxn$SendThread@1235]
- Session 0x304dff9e2260000 for server 127.0.0.1/127.0.0.1:27509, unexpected error, closing
socket connection and attempting reconnect
    [junit] java.net.ConnectException: Connection refused
    [junit] 	at sun.nio.ch.SocketChannelImpl.checkConnect(Native Method)
    [junit] 	at sun.nio.ch.SocketChannelImpl.finishConnect(SocketChannelImpl.java:717)
    [junit] 	at org.apache.zookeeper.ClientCnxnSocketNIO.doTransport(ClientCnxnSocketNIO.java:357)
    [junit] 	at org.apache.zookeeper.ClientCnxn$SendThread.run(ClientCnxn.java:1214)
    [junit] 2017-07-21 19:06:40,256 [myid:] - INFO  [ProcessThread(sid:0 cport:27626)::PrepRequestProcessor@614]
- Processed session termination for sessionid: 0x104dffce5a10000
    [junit] 2017-07-21 19:06:40,259 [myid:] - INFO  [SyncThread:0:MBeanRegistry@128] - Unregister
MBean [org.apache.ZooKeeperService:name0=StandaloneServer_port27626,name1=Connections,name2=127.0.0.1,name3=0x104dffce5a10000]
    [junit] 2017-07-21 19:06:40,260 [myid:] - INFO  [main:ZooKeeper@1329] - Session: 0x104dffce5a10000
closed
    [junit] 2017-07-21 19:06:40,260 [myid:] - INFO  [main-EventThread:ClientCnxn$EventThread@513]
- EventThread shut down for session: 0x104dffce5a10000
    [junit] 2017-07-21 19:06:40,260 [myid:] - INFO  [main:JUnit4ZKTestRunner$LoggedInvokeMethod@82]
- Memory used 156458
    [junit] 2017-07-21 19:06:40,260 [myid:] - INFO  [main:JUnit4ZKTestRunner$LoggedInvokeMethod@87]
- Number of threads 863
    [junit] 2017-07-21 19:06:40,260 [myid:] - INFO  [main:JUnit4ZKTestRunner$LoggedInvokeMethod@102]
- FINISHED TEST METHOD testWatcherAutoResetWithLocal
    [junit] 2017-07-21 19:06:40,260 [myid:] - INFO  [main:ClientBase@601] - tearDown starting
    [junit] 2017-07-21 19:06:40,261 [myid:] - INFO  [main:ClientBase@571] - STOPPING server
    [junit] 2017-07-21 19:06:40,261 [myid:] - INFO  [main:NettyServerCnxnFactory@464] - shutdown
called 0.0.0.0/0.0.0.0:27626
    [junit] 2017-07-21 19:06:40,262 [myid:] - INFO  [main:ZooKeeperServer@541] - shutting
down
    [junit] 2017-07-21 19:06:40,262 [myid:] - ERROR [main:ZooKeeperServer@505] - ZKShutdownHandler
is not registered, so ZooKeeper server won't take any action on ERROR or SHUTDOWN server state
changes
    [junit] 2017-07-21 19:06:40,262 [myid:] - INFO  [main:SessionTrackerImpl@232] - Shutting
down
    [junit] 2017-07-21 19:06:40,262 [myid:] - INFO  [main:PrepRequestProcessor@1008] - Shutting
down
    [junit] 2017-07-21 19:06:40,263 [myid:] - INFO  [main:SyncRequestProcessor@191] - Shutting
down
    [junit] 2017-07-21 19:06:40,263 [myid:] - INFO  [SyncThread:0:SyncRequestProcessor@169]
- SyncRequestProcessor exited!
    [junit] 2017-07-21 19:06:40,263 [myid:] - INFO  [main:FinalRequestProcessor@481] - shutdown
of request processor complete
    [junit] 2017-07-21 19:06:40,263 [myid:] - INFO  [ProcessThread(sid:0 cport:27626)::PrepRequestProcessor@155]
- PrepRequestProcessor exited loop!
    [junit] 2017-07-21 19:06:40,265 [myid:] - INFO  [main:MBeanRegistry@128] - Unregister
MBean [org.apache.ZooKeeperService:name0=StandaloneServer_port27626,name1=InMemoryDataTree]
    [junit] 2017-07-21 19:06:40,265 [myid:] - INFO  [main:MBeanRegistry@128] - Unregister
MBean [org.apache.ZooKeeperService:name0=StandaloneServer_port27626]
    [junit] 2017-07-21 19:06:40,266 [myid:] - INFO  [main:FourLetterWordMain@85] - connecting
to 127.0.0.1 27626
    [junit] 2017-07-21 19:06:40,266 [myid:] - INFO  [main:JMXEnv@146] - ensureOnly:[]
    [junit] 2017-07-21 19:06:40,271 [myid:] - INFO  [main:ClientBase@626] - fdcount after
test is: 2550 at start it was 2550
    [junit] 2017-07-21 19:06:40,271 [myid:] - INFO  [main:ZKTestCase$1@68] - SUCCEEDED testWatcherAutoResetWithLocal
    [junit] 2017-07-21 19:06:40,271 [myid:] - INFO  [main:ZKTestCase$1@63] - FINISHED testWatcherAutoResetWithLocal
    [junit] Tests run: 103, Failures: 0, Errors: 0, Skipped: 0, Time elapsed: 381.893 sec,
Thread: 7, Class: org.apache.zookeeper.test.NioNettySuiteTest
    [junit] 2017-07-21 19:06:40,506 [myid:127.0.0.1:27429] - INFO  [main-SendThread(127.0.0.1:27429):ClientCnxn$SendThread@1113]
- Opening socket connection to server 127.0.0.1/127.0.0.1:27429. Will not attempt to authenticate
using SASL (unknown error)
    [junit] 2017-07-21 19:06:40,507 [myid:127.0.0.1:27429] - WARN  [main-SendThread(127.0.0.1:27429):ClientCnxn$SendThread@1235]
- Session 0x104dff7662e0001 for server 127.0.0.1/127.0.0.1:27429, unexpected error, closing
socket connection and attempting reconnect
    [junit] java.net.ConnectException: Connection refused
    [junit] 	at sun.nio.ch.SocketChannelImpl.checkConnect(Native Method)
    [junit] 	at sun.nio.ch.SocketChannelImpl.finishConnect(SocketChannelImpl.java:717)
    [junit] 	at org.apache.zookeeper.ClientCnxnSocketNIO.doTransport(ClientCnxnSocketNIO.java:357)
    [junit] 	at org.apache.zookeeper.ClientCnxn$SendThread.run(ClientCnxn.java:1214)
    [junit] Running org.apache.zookeeper.server.quorum.Zab1_0Test in thread 1
    [junit] Tests run: 1, Failures: 0, Errors: 1, Skipped: 0, Time elapsed: 0 sec, Thread:
1, Class: org.apache.zookeeper.server.quorum.Zab1_0Test
    [junit] Test org.apache.zookeeper.server.quorum.Zab1_0Test FAILED (timeout)

fail.build.on.test.failure:

BUILD FAILED
/home/jenkins/jenkins-slave/workspace/ZooKeeper-trunk-jdk8/build.xml:1219: The following error
occurred while executing this line:
/home/jenkins/jenkins-slave/workspace/ZooKeeper-trunk-jdk8/build.xml:1223: Tests failed!

Total time: 17 minutes 13 seconds
Build step 'Invoke Ant' marked build as failure
[WARNINGS] Skipping publisher since build result is FAILURE
Recording test results
Email was triggered for: Failure - Any
Sending email for trigger: Failure - Any



###################################################################################
############################## FAILED TESTS (if any) ##############################
1 tests failed.
FAILED:  org.apache.zookeeper.server.quorum.Zab1_0Test.testNormalObserverRun

Error Message:
Timeout occurred. Please note the time in the report does not reflect the time until the timeout.

Stack Trace:
junit.framework.AssertionFailedError: Timeout occurred. Please note the time in the report
does not reflect the time until the timeout.
	at java.lang.Thread.run(Thread.java:748)
Mime
  • Unnamed multipart/mixed (inline, None, 0 bytes)
View raw message