zookeeper-dev mailing list archives

Site index · List index
Message view « Date » · « Thread »
Top « Date » · « Thread »
From Apache Jenkins Server <jenk...@builds.apache.org>
Subject ZooKeeper_branch34_jdk7 - Build # 1578 - Failure
Date Thu, 06 Jul 2017 02:51:22 GMT
See https://builds.apache.org/job/ZooKeeper_branch34_jdk7/1578/

###################################################################################
########################## LAST 60 LINES OF THE CONSOLE ###########################
[...truncated 31.59 MB...]
    [junit] 2017-07-06 02:51:18,439 [myid:] - INFO  [SyncThread:0:SyncRequestProcessor@186]
- SyncRequestProcessor exited!
    [junit] 2017-07-06 02:51:18,440 [myid:] - INFO  [main:FinalRequestProcessor@403] - shutdown
of request processor complete
    [junit] 2017-07-06 02:51:18,440 [myid:] - INFO  [main:FourLetterWordMain@62] - connecting
to 127.0.0.1 11221
    [junit] 2017-07-06 02:51:18,441 [myid:] - INFO  [main:JMXEnv@147] - ensureOnly:[]
    [junit] 2017-07-06 02:51:18,442 [myid:] - INFO  [main:ClientBase@489] - STARTING server
    [junit] 2017-07-06 02:51:18,443 [myid:] - INFO  [main:ClientBase@410] - CREATING server
instance 127.0.0.1:11221
    [junit] 2017-07-06 02:51:18,443 [myid:] - INFO  [main:ServerCnxnFactory@111] - Using org.apache.zookeeper.server.NIOServerCnxnFactory
as server connection factory
    [junit] 2017-07-06 02:51:18,443 [myid:] - INFO  [main:NIOServerCnxnFactory@89] - binding
to port 0.0.0.0/0.0.0.0:11221
    [junit] 2017-07-06 02:51:18,443 [myid:] - INFO  [main:ClientBase@385] - STARTING server
instance 127.0.0.1:11221
    [junit] 2017-07-06 02:51:18,444 [myid:] - INFO  [main:ZooKeeperServer@173] - Created server
with tickTime 3000 minSessionTimeout 6000 maxSessionTimeout 60000 datadir /home/jenkins/jenkins-slave/workspace/ZooKeeper_branch34_jdk7/build/test/tmp/test3578640634383721903.junit.dir/version-2
snapdir /home/jenkins/jenkins-slave/workspace/ZooKeeper_branch34_jdk7/build/test/tmp/test3578640634383721903.junit.dir/version-2
    [junit] 2017-07-06 02:51:18,448 [myid:] - ERROR [main:ZooKeeperServer@468] - ZKShutdownHandler
is not registered, so ZooKeeper server won't take any action on ERROR or SHUTDOWN server state
changes
    [junit] 2017-07-06 02:51:18,448 [myid:] - INFO  [main:FourLetterWordMain@62] - connecting
to 127.0.0.1 11221
    [junit] 2017-07-06 02:51:18,449 [myid:] - INFO  [NIOServerCxn.Factory:0.0.0.0/0.0.0.0:11221:NIOServerCnxnFactory@192]
- Accepted socket connection from /127.0.0.1:49018
    [junit] 2017-07-06 02:51:18,449 [myid:] - INFO  [NIOServerCxn.Factory:0.0.0.0/0.0.0.0:11221:NIOServerCnxn@883]
- Processing stat command from /127.0.0.1:49018
    [junit] 2017-07-06 02:51:18,449 [myid:] - INFO  [Thread-4:NIOServerCnxn$StatCommand@674]
- Stat command output
    [junit] 2017-07-06 02:51:18,450 [myid:] - INFO  [Thread-4:NIOServerCnxn@1044] - Closed
socket connection for client /127.0.0.1:49018 (no session established for client)
    [junit] 2017-07-06 02:51:18,450 [myid:] - INFO  [main:JMXEnv@230] - ensureParent:[InMemoryDataTree,
StandaloneServer_port]
    [junit] 2017-07-06 02:51:18,452 [myid:] - INFO  [main:JMXEnv@247] - expect:InMemoryDataTree
    [junit] 2017-07-06 02:51:18,453 [myid:] - INFO  [main:JMXEnv@251] - found:InMemoryDataTree
org.apache.ZooKeeperService:name0=StandaloneServer_port11221,name1=InMemoryDataTree
    [junit] 2017-07-06 02:51:18,453 [myid:] - INFO  [main:JMXEnv@247] - expect:StandaloneServer_port
    [junit] 2017-07-06 02:51:18,453 [myid:] - INFO  [main:JMXEnv@251] - found:StandaloneServer_port
org.apache.ZooKeeperService:name0=StandaloneServer_port11221
    [junit] 2017-07-06 02:51:18,453 [myid:] - INFO  [main:JUnit4ZKTestRunner$LoggedInvokeMethod@58]
- Memory used 35687
    [junit] 2017-07-06 02:51:18,453 [myid:] - INFO  [main:JUnit4ZKTestRunner$LoggedInvokeMethod@63]
- Number of threads 20
    [junit] 2017-07-06 02:51:18,454 [myid:] - INFO  [main:JUnit4ZKTestRunner$LoggedInvokeMethod@78]
- FINISHED TEST METHOD testQuota
    [junit] 2017-07-06 02:51:18,454 [myid:] - INFO  [main:ClientBase@566] - tearDown starting
    [junit] 2017-07-06 02:51:18,519 [myid:] - INFO  [main:ZooKeeper@684] - Session: 0x100027aaf030000
closed
    [junit] 2017-07-06 02:51:18,519 [myid:] - INFO  [main:ClientBase@536] - STOPPING server
    [junit] 2017-07-06 02:51:18,519 [myid:] - INFO  [main-EventThread:ClientCnxn$EventThread@520]
- EventThread shut down for session: 0x100027aaf030000
    [junit] 2017-07-06 02:51:18,520 [myid:] - INFO  [NIOServerCxn.Factory:0.0.0.0/0.0.0.0:11221:NIOServerCnxnFactory@219]
- NIOServerCnxn factory exited run method
    [junit] 2017-07-06 02:51:18,520 [myid:] - INFO  [main:ZooKeeperServer@501] - shutting
down
    [junit] 2017-07-06 02:51:18,520 [myid:] - ERROR [main:ZooKeeperServer@468] - ZKShutdownHandler
is not registered, so ZooKeeper server won't take any action on ERROR or SHUTDOWN server state
changes
    [junit] 2017-07-06 02:51:18,520 [myid:] - INFO  [main:SessionTrackerImpl@226] - Shutting
down
    [junit] 2017-07-06 02:51:18,520 [myid:] - INFO  [main:PrepRequestProcessor@769] - Shutting
down
    [junit] 2017-07-06 02:51:18,521 [myid:] - INFO  [main:SyncRequestProcessor@208] - Shutting
down
    [junit] 2017-07-06 02:51:18,521 [myid:] - INFO  [ProcessThread(sid:0 cport:11221)::PrepRequestProcessor@144]
- PrepRequestProcessor exited loop!
    [junit] 2017-07-06 02:51:18,521 [myid:] - INFO  [SyncThread:0:SyncRequestProcessor@186]
- SyncRequestProcessor exited!
    [junit] 2017-07-06 02:51:18,522 [myid:] - INFO  [main:FinalRequestProcessor@403] - shutdown
of request processor complete
    [junit] 2017-07-06 02:51:18,522 [myid:] - INFO  [main:FourLetterWordMain@62] - connecting
to 127.0.0.1 11221
    [junit] 2017-07-06 02:51:18,523 [myid:] - INFO  [main:JMXEnv@147] - ensureOnly:[]
    [junit] 2017-07-06 02:51:18,528 [myid:] - INFO  [main:ClientBase@591] - fdcount after
test is: 93 at start it was 81
    [junit] 2017-07-06 02:51:18,528 [myid:] - INFO  [main:ClientBase@593] - sleeping for 20
secs
    [junit] 2017-07-06 02:51:18,529 [myid:] - INFO  [main:ZKTestCase$1@69] - SUCCEEDED testQuota
    [junit] 2017-07-06 02:51:18,529 [myid:] - INFO  [main:ZKTestCase$1@64] - FINISHED testQuota
    [junit] Tests run: 1, Failures: 0, Errors: 0, Skipped: 0, Time elapsed: 0.659 sec
    [junit] 2017-07-06 02:51:18,547 [myid:] - INFO  [SessionTracker:SessionTrackerImpl@163]
- SessionTrackerImpl exited loop!
    [junit] 2017-07-06 02:51:18,547 [myid:] - INFO  [SessionTracker:SessionTrackerImpl@163]
- SessionTrackerImpl exited loop!
    [junit] 2017-07-06 02:51:18,547 [myid:] - INFO  [SessionTracker:SessionTrackerImpl@163]
- SessionTrackerImpl exited loop!

fail.build.on.test.failure:

BUILD FAILED
/home/jenkins/jenkins-slave/workspace/ZooKeeper_branch34_jdk7/build.xml:1330: The following
error occurred while executing this line:
/home/jenkins/jenkins-slave/workspace/ZooKeeper_branch34_jdk7/build.xml:1333: Tests failed!

Total time: 38 minutes 31 seconds
Build step 'Invoke Ant' marked build as failure
Recording test results
Email was triggered for: Failure - Any
Sending email for trigger: Failure - Any



###################################################################################
############################## FAILED TESTS (if any) ##############################
1 tests failed.
FAILED:  org.apache.zookeeper.test.FollowerTest.testNoLogBeforeLeaderEstablishment

Error Message:
Not following

Stack Trace:
junit.framework.AssertionFailedError: Not following
	at org.apache.zookeeper.test.FollowerTest.testNoLogBeforeLeaderEstablishment(FollowerTest.java:181)
	at org.apache.zookeeper.JUnit4ZKTestRunner$LoggedInvokeMethod.evaluate(JUnit4ZKTestRunner.java:55)
Mime
  • Unnamed multipart/mixed (inline, None, 0 bytes)
View raw message