zookeeper-dev mailing list archives

Site index · List index
Message view « Date » · « Thread »
Top « Date » · « Thread »
From Apache Jenkins Server <jenk...@builds.apache.org>
Subject ZooKeeper-trunk - Build # 3454 - Still Failing
Date Tue, 04 Jul 2017 07:09:28 GMT
See https://builds.apache.org/job/ZooKeeper-trunk/3454/

###################################################################################
########################## LAST 60 LINES OF THE CONSOLE ###########################
[...truncated 64.72 MB...]
    [junit] 2017-07-04 07:09:11,508 [myid:] - INFO  [main:ClientBase@571] - STOPPING server
    [junit] 2017-07-04 07:09:11,508 [myid:] - INFO  [main:NettyServerCnxnFactory@464] - shutdown
called 0.0.0.0/0.0.0.0:14161
    [junit] 2017-07-04 07:09:11,512 [myid:] - INFO  [main:ZooKeeperServer@541] - shutting
down
    [junit] 2017-07-04 07:09:11,512 [myid:] - ERROR [main:ZooKeeperServer@505] - ZKShutdownHandler
is not registered, so ZooKeeper server won't take any action on ERROR or SHUTDOWN server state
changes
    [junit] 2017-07-04 07:09:11,512 [myid:] - INFO  [main:SessionTrackerImpl@232] - Shutting
down
    [junit] 2017-07-04 07:09:11,513 [myid:] - INFO  [main:PrepRequestProcessor@1008] - Shutting
down
    [junit] 2017-07-04 07:09:11,513 [myid:] - INFO  [main:SyncRequestProcessor@191] - Shutting
down
    [junit] 2017-07-04 07:09:11,513 [myid:] - INFO  [ProcessThread(sid:0 cport:14161)::PrepRequestProcessor@155]
- PrepRequestProcessor exited loop!
    [junit] 2017-07-04 07:09:11,513 [myid:] - INFO  [SyncThread:0:SyncRequestProcessor@169]
- SyncRequestProcessor exited!
    [junit] 2017-07-04 07:09:11,513 [myid:] - INFO  [main:FinalRequestProcessor@481] - shutdown
of request processor complete
    [junit] 2017-07-04 07:09:11,514 [myid:] - INFO  [main:MBeanRegistry@128] - Unregister
MBean [org.apache.ZooKeeperService:name0=StandaloneServer_port14161,name1=InMemoryDataTree]
    [junit] 2017-07-04 07:09:11,514 [myid:] - INFO  [main:MBeanRegistry@128] - Unregister
MBean [org.apache.ZooKeeperService:name0=StandaloneServer_port14161]
    [junit] 2017-07-04 07:09:11,514 [myid:] - INFO  [main:FourLetterWordMain@85] - connecting
to 127.0.0.1 14161
    [junit] 2017-07-04 07:09:11,515 [myid:] - INFO  [main:JMXEnv@146] - ensureOnly:[]
    [junit] 2017-07-04 07:09:11,521 [myid:] - INFO  [main:ClientBase@626] - fdcount after
test is: 4848 at start it was 4848
    [junit] 2017-07-04 07:09:11,522 [myid:] - INFO  [main:ZKTestCase$1@68] - SUCCEEDED testWatcherAutoResetWithLocal
    [junit] 2017-07-04 07:09:11,522 [myid:] - INFO  [main:ZKTestCase$1@63] - FINISHED testWatcherAutoResetWithLocal
    [junit] Tests run: 103, Failures: 0, Errors: 0, Skipped: 0, Time elapsed: 495.665 sec,
Thread: 2, Class: org.apache.zookeeper.test.NioNettySuiteTest
    [junit] 2017-07-04 07:09:11,636 [myid:127.0.0.1:13979] - INFO  [main-SendThread(127.0.0.1:13979):ClientCnxn$SendThread@1113]
- Opening socket connection to server 127.0.0.1/127.0.0.1:13979. Will not attempt to authenticate
using SASL (unknown error)
    [junit] 2017-07-04 07:09:11,636 [myid:127.0.0.1:13979] - WARN  [main-SendThread(127.0.0.1:13979):ClientCnxn$SendThread@1235]
- Session 0x10163d5b73e0000 for server 127.0.0.1/127.0.0.1:13979, unexpected error, closing
socket connection and attempting reconnect
    [junit] java.net.ConnectException: Connection refused
    [junit] 	at sun.nio.ch.SocketChannelImpl.checkConnect(Native Method)
    [junit] 	at sun.nio.ch.SocketChannelImpl.finishConnect(SocketChannelImpl.java:744)
    [junit] 	at org.apache.zookeeper.ClientCnxnSocketNIO.doTransport(ClientCnxnSocketNIO.java:357)
    [junit] 	at org.apache.zookeeper.ClientCnxn$SendThread.run(ClientCnxn.java:1214)
    [junit] 2017-07-04 07:09:11,958 [myid:127.0.0.1:14044] - INFO  [main-SendThread(127.0.0.1:14044):ClientCnxn$SendThread@1113]
- Opening socket connection to server 127.0.0.1/127.0.0.1:14044. Will not attempt to authenticate
using SASL (unknown error)
    [junit] 2017-07-04 07:09:11,958 [myid:127.0.0.1:14044] - WARN  [main-SendThread(127.0.0.1:14044):ClientCnxn$SendThread@1235]
- Session 0x30163d869fe0000 for server 127.0.0.1/127.0.0.1:14044, unexpected error, closing
socket connection and attempting reconnect
    [junit] java.net.ConnectException: Connection refused
    [junit] 	at sun.nio.ch.SocketChannelImpl.checkConnect(Native Method)
    [junit] 	at sun.nio.ch.SocketChannelImpl.finishConnect(SocketChannelImpl.java:744)
    [junit] 	at org.apache.zookeeper.ClientCnxnSocketNIO.doTransport(ClientCnxnSocketNIO.java:357)
    [junit] 	at org.apache.zookeeper.ClientCnxn$SendThread.run(ClientCnxn.java:1214)

fail.build.on.test.failure:

BUILD FAILED
/home/jenkins/jenkins-slave/workspace/ZooKeeper-trunk/build.xml:1338: The following error
occurred while executing this line:
/home/jenkins/jenkins-slave/workspace/ZooKeeper-trunk/build.xml:1219: The following error
occurred while executing this line:
/home/jenkins/jenkins-slave/workspace/ZooKeeper-trunk/build.xml:1223: Tests failed!

Total time: 12 minutes 47 seconds
Build step 'Execute shell' marked build as failure
[FINDBUGS] Skipping publisher since build result is FAILURE
[WARNINGS] Skipping publisher since build result is FAILURE
Archiving artifacts
Setting JDK_1_7_LATEST__HOME=/home/jenkins/tools/java/latest1.7
Recording fingerprints
Setting JDK_1_7_LATEST__HOME=/home/jenkins/tools/java/latest1.7
[JIRA] Updating issue ZOOKEEPER-2355
[JIRA] Updating issue ZOOKEEPER-2818
Recording test results
Setting JDK_1_7_LATEST__HOME=/home/jenkins/tools/java/latest1.7
Publishing Javadoc
Setting JDK_1_7_LATEST__HOME=/home/jenkins/tools/java/latest1.7
Setting JDK_1_7_LATEST__HOME=/home/jenkins/tools/java/latest1.7
Email was triggered for: Failure - Any
Sending email for trigger: Failure - Any
Setting JDK_1_7_LATEST__HOME=/home/jenkins/tools/java/latest1.7
Setting JDK_1_7_LATEST__HOME=/home/jenkins/tools/java/latest1.7



###################################################################################
############################## FAILED TESTS (if any) ##############################
1 tests failed.
FAILED:  org.apache.zookeeper.test.ChrootClientTest.testNonExistingOpCode

Error Message:
expected:<-4> but was:<-6>

Stack Trace:
junit.framework.AssertionFailedError: expected:<-4> but was:<-6>
	at org.apache.zookeeper.test.ClientTest.testNonExistingOpCode(ClientTest.java:853)
	at org.apache.zookeeper.JUnit4ZKTestRunner$LoggedInvokeMethod.evaluate(JUnit4ZKTestRunner.java:79)
Mime
  • Unnamed multipart/mixed (inline, None, 0 bytes)
View raw message