zookeeper-dev mailing list archives

Site index · List index
Message view « Date » · « Thread »
Top « Date » · « Thread »
From Apache Jenkins Server <jenk...@builds.apache.org>
Subject ZooKeeper-trunk-openjdk7 - Build # 1543 - Still Failing
Date Wed, 12 Jul 2017 20:07:28 GMT
See https://builds.apache.org/job/ZooKeeper-trunk-openjdk7/1543/

###################################################################################
########################## LAST 60 LINES OF THE CONSOLE ###########################
[...truncated 59.29 MB...]
    [junit] 	at org.apache.zookeeper.ClientCnxnSocketNIO.doTransport(ClientCnxnSocketNIO.java:357)
    [junit] 	at org.apache.zookeeper.ClientCnxn$SendThread.run(ClientCnxn.java:1214)
    [junit] 2017-07-12 20:07:18,371 [myid:127.0.0.1:11225] - INFO  [main-SendThread(127.0.0.1:11225):ClientCnxn$SendThread@1113]
- Opening socket connection to server 127.0.0.1/127.0.0.1:11225. Will not attempt to authenticate
using SASL (unknown error)
    [junit] 2017-07-12 20:07:18,372 [myid:127.0.0.1:11225] - WARN  [main-SendThread(127.0.0.1:11225):ClientCnxn$SendThread@1235]
- Session 0x10562fb49610001 for server 127.0.0.1/127.0.0.1:11225, unexpected error, closing
socket connection and attempting reconnect
    [junit] java.net.ConnectException: Connection refused
    [junit] 	at sun.nio.ch.SocketChannelImpl.checkConnect(Native Method)
    [junit] 	at sun.nio.ch.SocketChannelImpl.finishConnect(SocketChannelImpl.java:739)
    [junit] 	at org.apache.zookeeper.ClientCnxnSocketNIO.doTransport(ClientCnxnSocketNIO.java:357)
    [junit] 	at org.apache.zookeeper.ClientCnxn$SendThread.run(ClientCnxn.java:1214)
    [junit] 2017-07-12 20:07:19,529 [myid:127.0.0.1:11222] - INFO  [main-SendThread(127.0.0.1:11222):ClientCnxn$SendThread@1113]
- Opening socket connection to server 127.0.0.1/127.0.0.1:11222. Will not attempt to authenticate
using SASL (unknown error)
    [junit] 2017-07-12 20:07:19,530 [myid:127.0.0.1:11222] - WARN  [main-SendThread(127.0.0.1:11222):ClientCnxn$SendThread@1235]
- Session 0x562fb47980001 for server 127.0.0.1/127.0.0.1:11222, unexpected error, closing
socket connection and attempting reconnect
    [junit] java.net.ConnectException: Connection refused
    [junit] 	at sun.nio.ch.SocketChannelImpl.checkConnect(Native Method)
    [junit] 	at sun.nio.ch.SocketChannelImpl.finishConnect(SocketChannelImpl.java:739)
    [junit] 	at org.apache.zookeeper.ClientCnxnSocketNIO.doTransport(ClientCnxnSocketNIO.java:357)
    [junit] 	at org.apache.zookeeper.ClientCnxn$SendThread.run(ClientCnxn.java:1214)
    [junit] 2017-07-12 20:07:19,667 [myid:127.0.0.1:11222] - INFO  [main-SendThread(127.0.0.1:11222):ClientCnxn$SendThread@1113]
- Opening socket connection to server 127.0.0.1/127.0.0.1:11222. Will not attempt to authenticate
using SASL (unknown error)
    [junit] 2017-07-12 20:07:19,667 [myid:127.0.0.1:11222] - WARN  [main-SendThread(127.0.0.1:11222):ClientCnxn$SendThread@1235]
- Session 0x562fb47980000 for server 127.0.0.1/127.0.0.1:11222, unexpected error, closing
socket connection and attempting reconnect
    [junit] java.net.ConnectException: Connection refused
    [junit] 	at sun.nio.ch.SocketChannelImpl.checkConnect(Native Method)
    [junit] 	at sun.nio.ch.SocketChannelImpl.finishConnect(SocketChannelImpl.java:739)
    [junit] 	at org.apache.zookeeper.ClientCnxnSocketNIO.doTransport(ClientCnxnSocketNIO.java:357)
    [junit] 	at org.apache.zookeeper.ClientCnxn$SendThread.run(ClientCnxn.java:1214)
    [junit] 2017-07-12 20:07:19,768 [myid:127.0.0.1:11225] - INFO  [main-SendThread(127.0.0.1:11225):ClientCnxn$SendThread@1113]
- Opening socket connection to server 127.0.0.1/127.0.0.1:11225. Will not attempt to authenticate
using SASL (unknown error)
    [junit] 2017-07-12 20:07:19,769 [myid:127.0.0.1:11225] - WARN  [main-SendThread(127.0.0.1:11225):ClientCnxn$SendThread@1235]
- Session 0x10562fb49610001 for server 127.0.0.1/127.0.0.1:11225, unexpected error, closing
socket connection and attempting reconnect
    [junit] java.net.ConnectException: Connection refused
    [junit] 	at sun.nio.ch.SocketChannelImpl.checkConnect(Native Method)
    [junit] 	at sun.nio.ch.SocketChannelImpl.finishConnect(SocketChannelImpl.java:739)
    [junit] 	at org.apache.zookeeper.ClientCnxnSocketNIO.doTransport(ClientCnxnSocketNIO.java:357)
    [junit] 	at org.apache.zookeeper.ClientCnxn$SendThread.run(ClientCnxn.java:1214)
    [junit] 2017-07-12 20:07:19,970 [myid:127.0.0.1:11225] - INFO  [main-SendThread(127.0.0.1:11225):ClientCnxn$SendThread@1113]
- Opening socket connection to server 127.0.0.1/127.0.0.1:11225. Will not attempt to authenticate
using SASL (unknown error)
    [junit] 2017-07-12 20:07:19,971 [myid:127.0.0.1:11225] - WARN  [main-SendThread(127.0.0.1:11225):ClientCnxn$SendThread@1235]
- Session 0x10562fb49610000 for server 127.0.0.1/127.0.0.1:11225, unexpected error, closing
socket connection and attempting reconnect
    [junit] java.net.ConnectException: Connection refused
    [junit] 	at sun.nio.ch.SocketChannelImpl.checkConnect(Native Method)
    [junit] 	at sun.nio.ch.SocketChannelImpl.finishConnect(SocketChannelImpl.java:739)
    [junit] 	at org.apache.zookeeper.ClientCnxnSocketNIO.doTransport(ClientCnxnSocketNIO.java:357)
    [junit] 	at org.apache.zookeeper.ClientCnxn$SendThread.run(ClientCnxn.java:1214)
    [junit] 2017-07-12 20:07:21,356 [myid:127.0.0.1:11222] - INFO  [main-SendThread(127.0.0.1:11222):ClientCnxn$SendThread@1113]
- Opening socket connection to server 127.0.0.1/127.0.0.1:11222. Will not attempt to authenticate
using SASL (unknown error)
    [junit] 2017-07-12 20:07:21,357 [myid:127.0.0.1:11222] - WARN  [main-SendThread(127.0.0.1:11222):ClientCnxn$SendThread@1235]
- Session 0x562fb47980000 for server 127.0.0.1/127.0.0.1:11222, unexpected error, closing
socket connection and attempting reconnect
    [junit] java.net.ConnectException: Connection refused
    [junit] 	at sun.nio.ch.SocketChannelImpl.checkConnect(Native Method)
    [junit] 	at sun.nio.ch.SocketChannelImpl.finishConnect(SocketChannelImpl.java:739)
    [junit] 	at org.apache.zookeeper.ClientCnxnSocketNIO.doTransport(ClientCnxnSocketNIO.java:357)
    [junit] 	at org.apache.zookeeper.ClientCnxn$SendThread.run(ClientCnxn.java:1214)
    [junit] Running org.apache.zookeeper.server.quorum.StandaloneDisabledTest in thread 1
    [junit] Tests run: 1, Failures: 0, Errors: 1, Skipped: 0, Time elapsed: 0 sec, Thread:
1, Class: org.apache.zookeeper.server.quorum.StandaloneDisabledTest
    [junit] Test org.apache.zookeeper.server.quorum.StandaloneDisabledTest FAILED (timeout)

fail.build.on.test.failure:

BUILD FAILED
/home/jenkins/jenkins-slave/workspace/ZooKeeper-trunk-openjdk7/build.xml:1219: The following
error occurred while executing this line:
/home/jenkins/jenkins-slave/workspace/ZooKeeper-trunk-openjdk7/build.xml:1223: Tests failed!

Total time: 16 minutes 10 seconds
Build step 'Invoke Ant' marked build as failure
Recording test results
Email was triggered for: Failure - Any
Sending email for trigger: Failure - Any



###################################################################################
############################## FAILED TESTS (if any) ##############################
1 tests failed.
FAILED:  org.apache.zookeeper.server.quorum.StandaloneDisabledTest.startSingleServerTest

Error Message:
Timeout occurred. Please note the time in the report does not reflect the time until the timeout.

Stack Trace:
junit.framework.AssertionFailedError: Timeout occurred. Please note the time in the report
does not reflect the time until the timeout.
	at java.lang.Thread.run(Thread.java:745)
Mime
  • Unnamed multipart/mixed (inline, None, 0 bytes)
View raw message