zookeeper-dev mailing list archives

Site index · List index
Message view « Date » · « Thread »
Top « Date » · « Thread »
From Apache Jenkins Server <jenk...@builds.apache.org>
Subject ZooKeeper-trunk - Build # 3485 - Still Failing
Date Mon, 31 Jul 2017 23:32:05 GMT
See https://builds.apache.org/job/ZooKeeper-trunk/3485/

###################################################################################
########################## LAST 60 LINES OF THE CONSOLE ###########################
[...truncated 66.73 MB...]
    [junit] 2017-07-31 23:31:18,121 [myid:] - INFO  [main:JUnit4ZKTestRunner$LoggedInvokeMethod@87]
- Number of threads 55
    [junit] 2017-07-31 23:31:18,121 [myid:] - INFO  [main:JUnit4ZKTestRunner$LoggedInvokeMethod@102]
- FINISHED TEST METHOD testManyChildWatchersAutoReset
    [junit] 2017-07-31 23:31:18,121 [myid:] - INFO  [main:ClientBase@601] - tearDown starting
    [junit] 2017-07-31 23:31:18,121 [myid:] - INFO  [ProcessThread(sid:0 cport:24690)::PrepRequestProcessor@614]
- Processed session termination for sessionid: 0x1008799f8440000
    [junit] 2017-07-31 23:31:18,128 [myid:] - INFO  [main:ZooKeeper@1332] - Session: 0x1008799f8440000
closed
    [junit] 2017-07-31 23:31:18,128 [myid:] - INFO  [main-EventThread:ClientCnxn$EventThread@513]
- EventThread shut down for session: 0x1008799f8440000
    [junit] 2017-07-31 23:31:18,128 [myid:] - INFO  [NIOWorkerThread-5:MBeanRegistry@128]
- Unregister MBean [org.apache.ZooKeeperService:name0=StandaloneServer_port24690,name1=Connections,name2=127.0.0.1,name3=0x1008799f8440000]
    [junit] 2017-07-31 23:31:18,129 [myid:] - INFO  [ProcessThread(sid:0 cport:24690)::PrepRequestProcessor@614]
- Processed session termination for sessionid: 0x1008799f8440001
    [junit] 2017-07-31 23:31:18,130 [myid:] - INFO  [NIOWorkerThread-5:NIOServerCnxn@627]
- Closed socket connection for client /127.0.0.1:41581 which had sessionid 0x1008799f8440000
    [junit] 2017-07-31 23:31:18,137 [myid:] - INFO  [main:ZooKeeper@1332] - Session: 0x1008799f8440001
closed
    [junit] 2017-07-31 23:31:18,137 [myid:] - INFO  [NIOWorkerThread-26:MBeanRegistry@128]
- Unregister MBean [org.apache.ZooKeeperService:name0=StandaloneServer_port24690,name1=Connections,name2=127.0.0.1,name3=0x1008799f8440001]
    [junit] 2017-07-31 23:31:18,137 [myid:] - INFO  [main:ClientBase@571] - STOPPING server
    [junit] 2017-07-31 23:31:18,137 [myid:] - INFO  [main-EventThread:ClientCnxn$EventThread@513]
- EventThread shut down for session: 0x1008799f8440001
    [junit] 2017-07-31 23:31:18,138 [myid:] - INFO  [ConnnectionExpirer:NIOServerCnxnFactory$ConnectionExpirerThread@583]
- ConnnectionExpirerThread interrupted
    [junit] 2017-07-31 23:31:18,137 [myid:] - INFO  [NIOWorkerThread-26:NIOServerCnxn@627]
- Closed socket connection for client /127.0.0.1:41599 which had sessionid 0x1008799f8440001
    [junit] 2017-07-31 23:31:18,140 [myid:] - INFO  [NIOServerCxnFactory.SelectorThread-1:NIOServerCnxnFactory$SelectorThread@420]
- selector thread exitted run method
    [junit] 2017-07-31 23:31:18,140 [myid:] - INFO  [NIOServerCxnFactory.AcceptThread:0.0.0.0/0.0.0.0:24690:NIOServerCnxnFactory$AcceptThread@219]
- accept thread exitted run method
    [junit] 2017-07-31 23:31:18,141 [myid:] - INFO  [NIOServerCxnFactory.SelectorThread-0:NIOServerCnxnFactory$SelectorThread@420]
- selector thread exitted run method
    [junit] 2017-07-31 23:31:18,141 [myid:] - INFO  [main:ZooKeeperServer@541] - shutting
down
    [junit] 2017-07-31 23:31:18,141 [myid:] - ERROR [main:ZooKeeperServer@505] - ZKShutdownHandler
is not registered, so ZooKeeper server won't take any action on ERROR or SHUTDOWN server state
changes
    [junit] 2017-07-31 23:31:18,142 [myid:] - INFO  [main:SessionTrackerImpl@232] - Shutting
down
    [junit] 2017-07-31 23:31:18,142 [myid:] - INFO  [main:PrepRequestProcessor@1008] - Shutting
down
    [junit] 2017-07-31 23:31:18,142 [myid:] - INFO  [main:SyncRequestProcessor@191] - Shutting
down
    [junit] 2017-07-31 23:31:18,142 [myid:] - INFO  [ProcessThread(sid:0 cport:24690)::PrepRequestProcessor@155]
- PrepRequestProcessor exited loop!
    [junit] 2017-07-31 23:31:18,142 [myid:] - INFO  [SyncThread:0:SyncRequestProcessor@169]
- SyncRequestProcessor exited!
    [junit] 2017-07-31 23:31:18,142 [myid:] - INFO  [main:FinalRequestProcessor@481] - shutdown
of request processor complete
    [junit] 2017-07-31 23:31:18,143 [myid:] - INFO  [main:MBeanRegistry@128] - Unregister
MBean [org.apache.ZooKeeperService:name0=StandaloneServer_port24690,name1=InMemoryDataTree]
    [junit] 2017-07-31 23:31:18,143 [myid:] - INFO  [main:MBeanRegistry@128] - Unregister
MBean [org.apache.ZooKeeperService:name0=StandaloneServer_port24690]
    [junit] 2017-07-31 23:31:18,143 [myid:] - INFO  [main:FourLetterWordMain@87] - connecting
to 127.0.0.1 24690
    [junit] 2017-07-31 23:31:18,144 [myid:] - INFO  [main:JMXEnv@146] - ensureOnly:[]
    [junit] 2017-07-31 23:31:18,197 [myid:] - INFO  [main:ClientBase@626] - fdcount after
test is: 54 at start it was 54
    [junit] 2017-07-31 23:31:18,198 [myid:] - INFO  [main:ZKTestCase$1@68] - SUCCEEDED testManyChildWatchersAutoReset
    [junit] 2017-07-31 23:31:18,198 [myid:] - INFO  [main:ZKTestCase$1@63] - FINISHED testManyChildWatchersAutoReset
    [junit] Tests run: 4, Failures: 0, Errors: 0, Skipped: 0, Time elapsed: 652.443 sec, Thread:
6, Class: org.apache.zookeeper.test.DisconnectedWatcherTest

fail.build.on.test.failure:

BUILD FAILED
/home/jenkins/jenkins-slave/workspace/ZooKeeper-trunk/build.xml:1339: The following error
occurred while executing this line:
/home/jenkins/jenkins-slave/workspace/ZooKeeper-trunk/build.xml:1220: The following error
occurred while executing this line:
/home/jenkins/jenkins-slave/workspace/ZooKeeper-trunk/build.xml:1224: Tests failed!

Total time: 14 minutes 22 seconds
Build step 'Execute shell' marked build as failure
[FINDBUGS] Skipping publisher since build result is FAILURE
[WARNINGS] Skipping publisher since build result is FAILURE
Archiving artifacts
Setting JDK_1_7_LATEST__HOME=/home/jenkins/tools/java/latest1.7
Recording fingerprints
Setting JDK_1_7_LATEST__HOME=/home/jenkins/tools/java/latest1.7
Recording test results
Setting JDK_1_7_LATEST__HOME=/home/jenkins/tools/java/latest1.7
Publishing Javadoc
Setting JDK_1_7_LATEST__HOME=/home/jenkins/tools/java/latest1.7
Setting JDK_1_7_LATEST__HOME=/home/jenkins/tools/java/latest1.7
Email was triggered for: Failure - Any
Sending email for trigger: Failure - Any
Setting JDK_1_7_LATEST__HOME=/home/jenkins/tools/java/latest1.7
Setting JDK_1_7_LATEST__HOME=/home/jenkins/tools/java/latest1.7



###################################################################################
############################## FAILED TESTS (if any) ##############################
1 tests failed.
FAILED:  org.apache.zookeeper.test.WatchEventWhenAutoResetTest.testNodeDataChanged

Error Message:
expected:<NodeDataChanged> but was:<NodeDeleted>

Stack Trace:
junit.framework.AssertionFailedError: expected:<NodeDataChanged> but was:<NodeDeleted>
	at org.apache.zookeeper.test.WatchEventWhenAutoResetTest$EventsWatcher.assertEvent(WatchEventWhenAutoResetTest.java:67)
	at org.apache.zookeeper.test.WatchEventWhenAutoResetTest.testNodeDataChanged(WatchEventWhenAutoResetTest.java:126)
	at org.apache.zookeeper.JUnit4ZKTestRunner$LoggedInvokeMethod.evaluate(JUnit4ZKTestRunner.java:79)
Mime
  • Unnamed multipart/mixed (inline, None, 0 bytes)
View raw message