zookeeper-dev mailing list archives

Site index · List index
Message view « Date » · « Thread »
Top « Date » · « Thread »
From Apache Jenkins Server <jenk...@builds.apache.org>
Subject ZooKeeper-trunk-openjdk7 - Build # 1539 - Still Failing
Date Sat, 08 Jul 2017 20:01:17 GMT
See https://builds.apache.org/job/ZooKeeper-trunk-openjdk7/1539/

###################################################################################
########################## LAST 60 LINES OF THE CONSOLE ###########################
[...truncated 58.73 MB...]
    [junit] 2017-07-08 20:01:12,250 [myid:127.0.0.1:30199] - INFO  [main-SendThread(127.0.0.1:30199):ClientCnxn$SendThread@1113]
- Opening socket connection to server 127.0.0.1/127.0.0.1:30199. Will not attempt to authenticate
using SASL (unknown error)
    [junit] 2017-07-08 20:01:12,250 [myid:127.0.0.1:30199] - WARN  [main-SendThread(127.0.0.1:30199):ClientCnxn$SendThread@1235]
- Session 0x2054ebe4b600000 for server 127.0.0.1/127.0.0.1:30199, unexpected error, closing
socket connection and attempting reconnect
    [junit] java.net.ConnectException: Connection refused
    [junit] 	at sun.nio.ch.SocketChannelImpl.checkConnect(Native Method)
    [junit] 	at sun.nio.ch.SocketChannelImpl.finishConnect(SocketChannelImpl.java:739)
    [junit] 	at org.apache.zookeeper.ClientCnxnSocketNIO.doTransport(ClientCnxnSocketNIO.java:357)
    [junit] 	at org.apache.zookeeper.ClientCnxn$SendThread.run(ClientCnxn.java:1214)
    [junit] 2017-07-08 20:01:12,581 [myid:] - INFO  [ProcessThread(sid:0 cport:30319)::PrepRequestProcessor@614]
- Processed session termination for sessionid: 0x1054ec1a9590000
    [junit] 2017-07-08 20:01:12,582 [myid:] - INFO  [SyncThread:0:MBeanRegistry@128] - Unregister
MBean [org.apache.ZooKeeperService:name0=StandaloneServer_port30319,name1=Connections,name2=127.0.0.1,name3=0x1054ec1a9590000]
    [junit] 2017-07-08 20:01:12,582 [myid:] - INFO  [main:ZooKeeper@1329] - Session: 0x1054ec1a9590000
closed
    [junit] 2017-07-08 20:01:12,582 [myid:] - INFO  [main-EventThread:ClientCnxn$EventThread@513]
- EventThread shut down for session: 0x1054ec1a9590000
    [junit] 2017-07-08 20:01:12,582 [myid:] - INFO  [main:JUnit4ZKTestRunner$LoggedInvokeMethod@82]
- Memory used 214529
    [junit] 2017-07-08 20:01:12,583 [myid:] - INFO  [main:JUnit4ZKTestRunner$LoggedInvokeMethod@87]
- Number of threads 2431
    [junit] 2017-07-08 20:01:12,583 [myid:] - INFO  [main:JUnit4ZKTestRunner$LoggedInvokeMethod@102]
- FINISHED TEST METHOD testWatcherAutoResetWithLocal
    [junit] 2017-07-08 20:01:12,583 [myid:] - INFO  [main:ClientBase@601] - tearDown starting
    [junit] 2017-07-08 20:01:12,583 [myid:] - INFO  [main:ClientBase@571] - STOPPING server
    [junit] 2017-07-08 20:01:12,583 [myid:] - INFO  [main:NettyServerCnxnFactory@464] - shutdown
called 0.0.0.0/0.0.0.0:30319
    [junit] 2017-07-08 20:01:12,586 [myid:] - INFO  [main:ZooKeeperServer@541] - shutting
down
    [junit] 2017-07-08 20:01:12,587 [myid:] - ERROR [main:ZooKeeperServer@505] - ZKShutdownHandler
is not registered, so ZooKeeper server won't take any action on ERROR or SHUTDOWN server state
changes
    [junit] 2017-07-08 20:01:12,587 [myid:] - INFO  [main:SessionTrackerImpl@232] - Shutting
down
    [junit] 2017-07-08 20:01:12,587 [myid:] - INFO  [main:PrepRequestProcessor@1008] - Shutting
down
    [junit] 2017-07-08 20:01:12,587 [myid:] - INFO  [main:SyncRequestProcessor@191] - Shutting
down
    [junit] 2017-07-08 20:01:12,587 [myid:] - INFO  [SyncThread:0:SyncRequestProcessor@169]
- SyncRequestProcessor exited!
    [junit] 2017-07-08 20:01:12,587 [myid:] - INFO  [main:FinalRequestProcessor@481] - shutdown
of request processor complete
    [junit] 2017-07-08 20:01:12,587 [myid:] - INFO  [ProcessThread(sid:0 cport:30319)::PrepRequestProcessor@155]
- PrepRequestProcessor exited loop!
    [junit] 2017-07-08 20:01:12,587 [myid:] - INFO  [main:MBeanRegistry@128] - Unregister
MBean [org.apache.ZooKeeperService:name0=StandaloneServer_port30319,name1=InMemoryDataTree]
    [junit] 2017-07-08 20:01:12,588 [myid:] - INFO  [main:MBeanRegistry@128] - Unregister
MBean [org.apache.ZooKeeperService:name0=StandaloneServer_port30319]
    [junit] 2017-07-08 20:01:12,588 [myid:] - INFO  [main:FourLetterWordMain@85] - connecting
to 127.0.0.1 30319
    [junit] 2017-07-08 20:01:12,588 [myid:] - INFO  [main:JMXEnv@146] - ensureOnly:[]
    [junit] 2017-07-08 20:01:12,598 [myid:] - INFO  [main:ClientBase@626] - fdcount after
test is: 7148 at start it was 7148
    [junit] 2017-07-08 20:01:12,598 [myid:] - INFO  [main:ZKTestCase$1@68] - SUCCEEDED testWatcherAutoResetWithLocal
    [junit] 2017-07-08 20:01:12,598 [myid:] - INFO  [main:ZKTestCase$1@63] - FINISHED testWatcherAutoResetWithLocal
    [junit] Tests run: 103, Failures: 0, Errors: 0, Skipped: 0, Time elapsed: 413.72 sec,
Thread: 8, Class: org.apache.zookeeper.test.NioNettySuiteTest
    [junit] 2017-07-08 20:01:12,653 [myid:127.0.0.1:30202] - INFO  [main-SendThread(127.0.0.1:30202):ClientCnxn$SendThread@1113]
- Opening socket connection to server 127.0.0.1/127.0.0.1:30202. Will not attempt to authenticate
using SASL (unknown error)
    [junit] 2017-07-08 20:01:12,654 [myid:127.0.0.1:30202] - WARN  [main-SendThread(127.0.0.1:30202):ClientCnxn$SendThread@1235]
- Session 0x3054ebe4b640000 for server 127.0.0.1/127.0.0.1:30202, unexpected error, closing
socket connection and attempting reconnect
    [junit] java.net.ConnectException: Connection refused
    [junit] 	at sun.nio.ch.SocketChannelImpl.checkConnect(Native Method)
    [junit] 	at sun.nio.ch.SocketChannelImpl.finishConnect(SocketChannelImpl.java:739)
    [junit] 	at org.apache.zookeeper.ClientCnxnSocketNIO.doTransport(ClientCnxnSocketNIO.java:357)
    [junit] 	at org.apache.zookeeper.ClientCnxn$SendThread.run(ClientCnxn.java:1214)
    [junit] 2017-07-08 20:01:12,719 [myid:127.0.0.1:30073] - INFO  [main-SendThread(127.0.0.1:30073):ClientCnxn$SendThread@1113]
- Opening socket connection to server 127.0.0.1/127.0.0.1:30073. Will not attempt to authenticate
using SASL (unknown error)
    [junit] 2017-07-08 20:01:12,720 [myid:127.0.0.1:30073] - WARN  [main-SendThread(127.0.0.1:30073):ClientCnxn$SendThread@1235]
- Session 0x1054ebb74b40000 for server 127.0.0.1/127.0.0.1:30073, unexpected error, closing
socket connection and attempting reconnect
    [junit] java.net.ConnectException: Connection refused
    [junit] 	at sun.nio.ch.SocketChannelImpl.checkConnect(Native Method)
    [junit] 	at sun.nio.ch.SocketChannelImpl.finishConnect(SocketChannelImpl.java:739)
    [junit] 	at org.apache.zookeeper.ClientCnxnSocketNIO.doTransport(ClientCnxnSocketNIO.java:357)
    [junit] 	at org.apache.zookeeper.ClientCnxn$SendThread.run(ClientCnxn.java:1214)

fail.build.on.test.failure:

BUILD FAILED
/home/jenkins/jenkins-slave/workspace/ZooKeeper-trunk-openjdk7/build.xml:1219: The following
error occurred while executing this line:
/home/jenkins/jenkins-slave/workspace/ZooKeeper-trunk-openjdk7/build.xml:1223: Tests failed!

Total time: 10 minutes 3 seconds
Build step 'Invoke Ant' marked build as failure
Recording test results
Email was triggered for: Failure - Any
Sending email for trigger: Failure - Any



###################################################################################
############################## FAILED TESTS (if any) ##############################
3 tests failed.
FAILED:  org.apache.zookeeper.server.quorum.Zab1_0Test.testNormalFollowerRunWithDiff

Error Message:
expected:<4294967298> but was:<0>

Stack Trace:
junit.framework.AssertionFailedError: expected:<4294967298> but was:<0>
	at org.apache.zookeeper.server.quorum.Zab1_0Test$5.converseWithFollower(Zab1_0Test.java:869)
	at org.apache.zookeeper.server.quorum.Zab1_0Test.testFollowerConversation(Zab1_0Test.java:517)
	at org.apache.zookeeper.server.quorum.Zab1_0Test.testNormalFollowerRunWithDiff(Zab1_0Test.java:784)
	at org.apache.zookeeper.JUnit4ZKTestRunner$LoggedInvokeMethod.evaluate(JUnit4ZKTestRunner.java:79)


FAILED:  org.apache.zookeeper.test.AsyncHammerTest.testObserversHammer

Error Message:
unable to create new native thread

Stack Trace:
java.lang.OutOfMemoryError: unable to create new native thread
	at java.lang.Thread.start0(Native Method)
	at java.lang.Thread.start(Thread.java:714)
	at org.apache.zookeeper.server.quorum.FastLeaderElection$Messenger.start(FastLeaderElection.java:520)
	at org.apache.zookeeper.server.quorum.FastLeaderElection.start(FastLeaderElection.java:637)
	at org.apache.zookeeper.server.quorum.QuorumPeer.createElectionAlgorithm(QuorumPeer.java:954)
	at org.apache.zookeeper.server.quorum.QuorumPeer.startLeaderElection(QuorumPeer.java:843)
	at org.apache.zookeeper.server.quorum.QuorumPeer.start(QuorumPeer.java:779)
	at org.apache.zookeeper.test.QuorumBase.startServers(QuorumBase.java:210)
	at org.apache.zookeeper.test.QuorumBase.setUp(QuorumBase.java:120)
	at org.apache.zookeeper.test.AsyncHammerTest.setUp(AsyncHammerTest.java:52)
	at org.apache.zookeeper.test.AsyncHammerTest.testObserversHammer(AsyncHammerTest.java:202)
	at org.apache.zookeeper.JUnit4ZKTestRunner$LoggedInvokeMethod.evaluate(JUnit4ZKTestRunner.java:79)


FAILED:  org.apache.zookeeper.server.quorum.ReconfigDuringLeaderSyncTest.testDuringLeaderSync

Error Message:
zoo.cfg.dynamic.next is not deleted.

Stack Trace:
junit.framework.AssertionFailedError: zoo.cfg.dynamic.next is not deleted.
	at org.apache.zookeeper.server.quorum.ReconfigDuringLeaderSyncTest.testDuringLeaderSync(ReconfigDuringLeaderSyncTest.java:165)
	at org.apache.zookeeper.JUnit4ZKTestRunner$LoggedInvokeMethod.evaluate(JUnit4ZKTestRunner.java:79)
Mime
  • Unnamed multipart/mixed (inline, None, 0 bytes)
View raw message