zookeeper-dev mailing list archives

Site index · List index
Message view « Date » · « Thread »
Top « Date » · « Thread »
From Apache Jenkins Server <jenk...@builds.apache.org>
Subject ZooKeeper-trunk-jdk8 - Build # 1143 - Still Failing
Date Thu, 27 Jul 2017 22:15:57 GMT
See https://builds.apache.org/job/ZooKeeper-trunk-jdk8/1143/

###################################################################################
########################## LAST 60 LINES OF THE CONSOLE ###########################
[...truncated 64.58 MB...]
    [junit] 2017-07-27 22:15:52,125 [myid:127.0.0.1:13979] - WARN  [main-SendThread(127.0.0.1:13979):ClientCnxn$SendThread@1235]
- Session 0x104ff8aba910000 for server 127.0.0.1/127.0.0.1:13979, unexpected error, closing
socket connection and attempting reconnect
    [junit] java.net.ConnectException: Connection refused
    [junit] 	at sun.nio.ch.SocketChannelImpl.checkConnect(Native Method)
    [junit] 	at sun.nio.ch.SocketChannelImpl.finishConnect(SocketChannelImpl.java:717)
    [junit] 	at org.apache.zookeeper.ClientCnxnSocketNIO.doTransport(ClientCnxnSocketNIO.java:357)
    [junit] 	at org.apache.zookeeper.ClientCnxn$SendThread.run(ClientCnxn.java:1214)
    [junit] 2017-07-27 22:15:52,364 [myid:127.0.0.1:13964] - INFO  [main-SendThread(127.0.0.1:13964):ClientCnxn$SendThread@1113]
- Opening socket connection to server 127.0.0.1/127.0.0.1:13964. Will not attempt to authenticate
using SASL (unknown error)
    [junit] 2017-07-27 22:15:52,364 [myid:127.0.0.1:13964] - WARN  [main-SendThread(127.0.0.1:13964):ClientCnxn$SendThread@1235]
- Session 0x104ff8a55b00001 for server 127.0.0.1/127.0.0.1:13964, unexpected error, closing
socket connection and attempting reconnect
    [junit] java.net.ConnectException: Connection refused
    [junit] 	at sun.nio.ch.SocketChannelImpl.checkConnect(Native Method)
    [junit] 	at sun.nio.ch.SocketChannelImpl.finishConnect(SocketChannelImpl.java:717)
    [junit] 	at org.apache.zookeeper.ClientCnxnSocketNIO.doTransport(ClientCnxnSocketNIO.java:357)
    [junit] 	at org.apache.zookeeper.ClientCnxn$SendThread.run(ClientCnxn.java:1214)
    [junit] 2017-07-27 22:15:52,380 [myid:] - INFO  [ProcessThread(sid:0 cport:14161)::PrepRequestProcessor@614]
- Processed session termination for sessionid: 0x104ff9041970000
    [junit] 2017-07-27 22:15:52,383 [myid:] - INFO  [SyncThread:0:MBeanRegistry@128] - Unregister
MBean [org.apache.ZooKeeperService:name0=StandaloneServer_port14161,name1=Connections,name2=127.0.0.1,name3=0x104ff9041970000]
    [junit] 2017-07-27 22:15:52,384 [myid:] - INFO  [main:ZooKeeper@1329] - Session: 0x104ff9041970000
closed
    [junit] 2017-07-27 22:15:52,384 [myid:] - INFO  [main-EventThread:ClientCnxn$EventThread@513]
- EventThread shut down for session: 0x104ff9041970000
    [junit] 2017-07-27 22:15:52,384 [myid:] - INFO  [main:JUnit4ZKTestRunner$LoggedInvokeMethod@82]
- Memory used 161560
    [junit] 2017-07-27 22:15:52,384 [myid:] - INFO  [main:JUnit4ZKTestRunner$LoggedInvokeMethod@87]
- Number of threads 864
    [junit] 2017-07-27 22:15:52,384 [myid:] - INFO  [main:JUnit4ZKTestRunner$LoggedInvokeMethod@102]
- FINISHED TEST METHOD testWatcherAutoResetWithLocal
    [junit] 2017-07-27 22:15:52,384 [myid:] - INFO  [main:ClientBase@601] - tearDown starting
    [junit] 2017-07-27 22:15:52,384 [myid:] - INFO  [main:ClientBase@571] - STOPPING server
    [junit] 2017-07-27 22:15:52,385 [myid:] - INFO  [main:NettyServerCnxnFactory@464] - shutdown
called 0.0.0.0/0.0.0.0:14161
    [junit] 2017-07-27 22:15:52,386 [myid:] - INFO  [main:ZooKeeperServer@541] - shutting
down
    [junit] 2017-07-27 22:15:52,386 [myid:] - ERROR [main:ZooKeeperServer@505] - ZKShutdownHandler
is not registered, so ZooKeeper server won't take any action on ERROR or SHUTDOWN server state
changes
    [junit] 2017-07-27 22:15:52,386 [myid:] - INFO  [main:SessionTrackerImpl@232] - Shutting
down
    [junit] 2017-07-27 22:15:52,387 [myid:] - INFO  [main:PrepRequestProcessor@1008] - Shutting
down
    [junit] 2017-07-27 22:15:52,387 [myid:] - INFO  [main:SyncRequestProcessor@191] - Shutting
down
    [junit] 2017-07-27 22:15:52,387 [myid:] - INFO  [SyncThread:0:SyncRequestProcessor@169]
- SyncRequestProcessor exited!
    [junit] 2017-07-27 22:15:52,387 [myid:] - INFO  [main:FinalRequestProcessor@481] - shutdown
of request processor complete
    [junit] 2017-07-27 22:15:52,387 [myid:] - INFO  [ProcessThread(sid:0 cport:14161)::PrepRequestProcessor@155]
- PrepRequestProcessor exited loop!
    [junit] 2017-07-27 22:15:52,387 [myid:] - INFO  [main:MBeanRegistry@128] - Unregister
MBean [org.apache.ZooKeeperService:name0=StandaloneServer_port14161,name1=InMemoryDataTree]
    [junit] 2017-07-27 22:15:52,388 [myid:] - INFO  [main:MBeanRegistry@128] - Unregister
MBean [org.apache.ZooKeeperService:name0=StandaloneServer_port14161]
    [junit] 2017-07-27 22:15:52,388 [myid:] - INFO  [main:FourLetterWordMain@85] - connecting
to 127.0.0.1 14161
    [junit] 2017-07-27 22:15:52,388 [myid:] - INFO  [main:JMXEnv@146] - ensureOnly:[]
    [junit] 2017-07-27 22:15:52,393 [myid:] - INFO  [main:ClientBase@626] - fdcount after
test is: 2550 at start it was 2550
    [junit] 2017-07-27 22:15:52,393 [myid:] - INFO  [main:ZKTestCase$1@68] - SUCCEEDED testWatcherAutoResetWithLocal
    [junit] 2017-07-27 22:15:52,393 [myid:] - INFO  [main:ZKTestCase$1@63] - FINISHED testWatcherAutoResetWithLocal
    [junit] Tests run: 103, Failures: 0, Errors: 0, Skipped: 0, Time elapsed: 420.176 sec,
Thread: 2, Class: org.apache.zookeeper.test.NioNettySuiteTest
    [junit] 2017-07-27 22:15:52,630 [myid:127.0.0.1:14038] - INFO  [main-SendThread(127.0.0.1:14038):ClientCnxn$SendThread@1113]
- Opening socket connection to server 127.0.0.1/127.0.0.1:14038. Will not attempt to authenticate
using SASL (unknown error)
    [junit] 2017-07-27 22:15:52,630 [myid:127.0.0.1:14038] - WARN  [main-SendThread(127.0.0.1:14038):ClientCnxn$SendThread@1235]
- Session 0x104ff8d1c1c0000 for server 127.0.0.1/127.0.0.1:14038, unexpected error, closing
socket connection and attempting reconnect
    [junit] java.net.ConnectException: Connection refused
    [junit] 	at sun.nio.ch.SocketChannelImpl.checkConnect(Native Method)
    [junit] 	at sun.nio.ch.SocketChannelImpl.finishConnect(SocketChannelImpl.java:717)
    [junit] 	at org.apache.zookeeper.ClientCnxnSocketNIO.doTransport(ClientCnxnSocketNIO.java:357)
    [junit] 	at org.apache.zookeeper.ClientCnxn$SendThread.run(ClientCnxn.java:1214)

fail.build.on.test.failure:

BUILD FAILED
/home/jenkins/jenkins-slave/workspace/ZooKeeper-trunk-jdk8/build.xml:1219: The following error
occurred while executing this line:
/home/jenkins/jenkins-slave/workspace/ZooKeeper-trunk-jdk8/build.xml:1223: Tests failed!

Total time: 11 minutes 1 second
Build step 'Invoke Ant' marked build as failure
[WARNINGS] Skipping publisher since build result is FAILURE
Recording test results
Email was triggered for: Failure - Any
Sending email for trigger: Failure - Any



###################################################################################
############################## FAILED TESTS (if any) ##############################
1 tests failed.
FAILED:  org.apache.zookeeper.test.ChrootClientTest.testNonExistingOpCode

Error Message:
expected:<-4> but was:<-6>

Stack Trace:
junit.framework.AssertionFailedError: expected:<-4> but was:<-6>
	at org.apache.zookeeper.test.ClientTest.testNonExistingOpCode(ClientTest.java:853)
	at org.apache.zookeeper.JUnit4ZKTestRunner$LoggedInvokeMethod.evaluate(JUnit4ZKTestRunner.java:79)
Mime
  • Unnamed multipart/mixed (inline, None, 0 bytes)
View raw message