zookeeper-dev mailing list archives

Site index · List index
Message view « Date » · « Thread »
Top « Date » · « Thread »
From Apache Jenkins Server <jenk...@builds.apache.org>
Subject ZooKeeper-trunk - Build # 3461 - Still Failing
Date Sun, 09 Jul 2017 23:27:51 GMT
See https://builds.apache.org/job/ZooKeeper-trunk/3461/

###################################################################################
########################## LAST 60 LINES OF THE CONSOLE ###########################
[...truncated 64.57 MB...]
    [junit] 	at org.apache.zookeeper.ClientCnxn$SendThread.run(ClientCnxn.java:1214)
    [junit] 2017-07-09 23:27:38,828 [myid:127.0.0.1:30137] - INFO  [main-SendThread(127.0.0.1:30137):ClientCnxn$SendThread@1113]
- Opening socket connection to server 127.0.0.1/127.0.0.1:30137. Will not attempt to authenticate
using SASL (unknown error)
    [junit] 2017-07-09 23:27:38,828 [myid:127.0.0.1:30137] - WARN  [main-SendThread(127.0.0.1:30137):ClientCnxn$SendThread@1235]
- Session 0x100164ef75f0000 for server 127.0.0.1/127.0.0.1:30137, unexpected error, closing
socket connection and attempting reconnect
    [junit] java.net.ConnectException: Connection refused
    [junit] 	at sun.nio.ch.SocketChannelImpl.checkConnect(Native Method)
    [junit] 	at sun.nio.ch.SocketChannelImpl.finishConnect(SocketChannelImpl.java:744)
    [junit] 	at org.apache.zookeeper.ClientCnxnSocketNIO.doTransport(ClientCnxnSocketNIO.java:357)
    [junit] 	at org.apache.zookeeper.ClientCnxn$SendThread.run(ClientCnxn.java:1214)
    [junit] 2017-07-09 23:27:39,128 [myid:] - INFO  [ProcessThread(sid:0 cport:30319)::PrepRequestProcessor@614]
- Processed session termination for sessionid: 0x100165473e20000
    [junit] 2017-07-09 23:27:39,135 [myid:] - INFO  [SyncThread:0:MBeanRegistry@128] - Unregister
MBean [org.apache.ZooKeeperService:name0=StandaloneServer_port30319,name1=Connections,name2=127.0.0.1,name3=0x100165473e20000]
    [junit] 2017-07-09 23:27:39,136 [myid:] - INFO  [main:ZooKeeper@1329] - Session: 0x100165473e20000
closed
    [junit] 2017-07-09 23:27:39,136 [myid:] - INFO  [main-EventThread:ClientCnxn$EventThread@513]
- EventThread shut down for session: 0x100165473e20000
    [junit] 2017-07-09 23:27:39,136 [myid:] - INFO  [main:JUnit4ZKTestRunner$LoggedInvokeMethod@82]
- Memory used 175049
    [junit] 2017-07-09 23:27:39,136 [myid:] - INFO  [main:JUnit4ZKTestRunner$LoggedInvokeMethod@87]
- Number of threads 1647
    [junit] 2017-07-09 23:27:39,136 [myid:] - INFO  [main:JUnit4ZKTestRunner$LoggedInvokeMethod@102]
- FINISHED TEST METHOD testWatcherAutoResetWithLocal
    [junit] 2017-07-09 23:27:39,136 [myid:] - INFO  [main:ClientBase@601] - tearDown starting
    [junit] 2017-07-09 23:27:39,136 [myid:] - INFO  [main:ClientBase@571] - STOPPING server
    [junit] 2017-07-09 23:27:39,136 [myid:] - INFO  [main:NettyServerCnxnFactory@464] - shutdown
called 0.0.0.0/0.0.0.0:30319
    [junit] 2017-07-09 23:27:39,142 [myid:] - INFO  [main:ZooKeeperServer@541] - shutting
down
    [junit] 2017-07-09 23:27:39,142 [myid:] - ERROR [main:ZooKeeperServer@505] - ZKShutdownHandler
is not registered, so ZooKeeper server won't take any action on ERROR or SHUTDOWN server state
changes
    [junit] 2017-07-09 23:27:39,142 [myid:] - INFO  [main:SessionTrackerImpl@232] - Shutting
down
    [junit] 2017-07-09 23:27:39,142 [myid:] - INFO  [main:PrepRequestProcessor@1008] - Shutting
down
    [junit] 2017-07-09 23:27:39,142 [myid:] - INFO  [main:SyncRequestProcessor@191] - Shutting
down
    [junit] 2017-07-09 23:27:39,142 [myid:] - INFO  [SyncThread:0:SyncRequestProcessor@169]
- SyncRequestProcessor exited!
    [junit] 2017-07-09 23:27:39,142 [myid:] - INFO  [ProcessThread(sid:0 cport:30319)::PrepRequestProcessor@155]
- PrepRequestProcessor exited loop!
    [junit] 2017-07-09 23:27:39,143 [myid:] - INFO  [main:FinalRequestProcessor@481] - shutdown
of request processor complete
    [junit] 2017-07-09 23:27:39,143 [myid:] - INFO  [main:MBeanRegistry@128] - Unregister
MBean [org.apache.ZooKeeperService:name0=StandaloneServer_port30319,name1=InMemoryDataTree]
    [junit] 2017-07-09 23:27:39,143 [myid:] - INFO  [main:MBeanRegistry@128] - Unregister
MBean [org.apache.ZooKeeperService:name0=StandaloneServer_port30319]
    [junit] 2017-07-09 23:27:39,143 [myid:] - INFO  [main:FourLetterWordMain@85] - connecting
to 127.0.0.1 30319
    [junit] 2017-07-09 23:27:39,144 [myid:] - INFO  [main:JMXEnv@146] - ensureOnly:[]
    [junit] 2017-07-09 23:27:39,149 [myid:] - INFO  [main:ClientBase@626] - fdcount after
test is: 4846 at start it was 4846
    [junit] 2017-07-09 23:27:39,149 [myid:] - INFO  [main:ZKTestCase$1@68] - SUCCEEDED testWatcherAutoResetWithLocal
    [junit] 2017-07-09 23:27:39,150 [myid:] - INFO  [main:ZKTestCase$1@63] - FINISHED testWatcherAutoResetWithLocal
    [junit] Tests run: 103, Failures: 0, Errors: 0, Skipped: 0, Time elapsed: 442.234 sec,
Thread: 8, Class: org.apache.zookeeper.test.NioNettySuiteTest

fail.build.on.test.failure:

BUILD FAILED
/home/jenkins/jenkins-slave/workspace/ZooKeeper-trunk/build.xml:1338: The following error
occurred while executing this line:
/home/jenkins/jenkins-slave/workspace/ZooKeeper-trunk/build.xml:1219: The following error
occurred while executing this line:
/home/jenkins/jenkins-slave/workspace/ZooKeeper-trunk/build.xml:1223: Tests failed!

Total time: 11 minutes 36 seconds
Build step 'Execute shell' marked build as failure
[FINDBUGS] Skipping publisher since build result is FAILURE
[WARNINGS] Skipping publisher since build result is FAILURE
Archiving artifacts
Setting JDK_1_7_LATEST__HOME=/home/jenkins/tools/java/latest1.7
Recording fingerprints
Setting JDK_1_7_LATEST__HOME=/home/jenkins/tools/java/latest1.7
Recording test results
Setting JDK_1_7_LATEST__HOME=/home/jenkins/tools/java/latest1.7
Publishing Javadoc
Setting JDK_1_7_LATEST__HOME=/home/jenkins/tools/java/latest1.7
Setting JDK_1_7_LATEST__HOME=/home/jenkins/tools/java/latest1.7
Email was triggered for: Failure - Any
Sending email for trigger: Failure - Any
Setting JDK_1_7_LATEST__HOME=/home/jenkins/tools/java/latest1.7
Setting JDK_1_7_LATEST__HOME=/home/jenkins/tools/java/latest1.7



###################################################################################
############################## FAILED TESTS (if any) ##############################
1 tests failed.
FAILED:  org.apache.zookeeper.server.quorum.ReconfigDuringLeaderSyncTest.testDuringLeaderSync

Error Message:
zoo.cfg.dynamic.next is not deleted.

Stack Trace:
junit.framework.AssertionFailedError: zoo.cfg.dynamic.next is not deleted.
	at org.apache.zookeeper.server.quorum.ReconfigDuringLeaderSyncTest.testDuringLeaderSync(ReconfigDuringLeaderSyncTest.java:165)
	at org.apache.zookeeper.JUnit4ZKTestRunner$LoggedInvokeMethod.evaluate(JUnit4ZKTestRunner.java:79)
Mime
  • Unnamed multipart/mixed (inline, None, 0 bytes)
View raw message