zookeeper-dev mailing list archives

Site index · List index
Message view « Date » · « Thread »
Top « Date » · « Thread »
From Apache Jenkins Server <jenk...@builds.apache.org>
Subject ZooKeeper-trunk - Build # 3474 - Still Failing
Date Sun, 23 Jul 2017 23:30:44 GMT
See https://builds.apache.org/job/ZooKeeper-trunk/3474/

###################################################################################
########################## LAST 60 LINES OF THE CONSOLE ###########################
[...truncated 64.76 MB...]
    [junit] 2017-07-23 23:29:18,347 [myid:] - INFO  [main:ZKTestCase$1@68] - SUCCEEDED testWatcherAutoResetWithLocal
    [junit] 2017-07-23 23:29:18,347 [myid:] - INFO  [main:ZKTestCase$1@63] - FINISHED testWatcherAutoResetWithLocal
    [junit] Tests run: 103, Failures: 0, Errors: 0, Skipped: 0, Time elapsed: 465.245 sec,
Thread: 6, Class: org.apache.zookeeper.test.NettyNettySuiteTest
    [junit] 2017-07-23 23:29:18,762 [myid:127.0.0.1:24736] - INFO  [main-SendThread(127.0.0.1:24736):ClientCnxn$SendThread@1113]
- Opening socket connection to server 127.0.0.1/127.0.0.1:24736. Will not attempt to authenticate
using SASL (unknown error)
    [junit] 2017-07-23 23:29:18,763 [myid:] - INFO  [New I/O boss #4917:ClientCnxnSocketNetty$1@127]
- future isn't success, cause: {}
    [junit] java.net.ConnectException: Connection refused: 127.0.0.1/127.0.0.1:24736
    [junit] 	at sun.nio.ch.SocketChannelImpl.checkConnect(Native Method)
    [junit] 	at sun.nio.ch.SocketChannelImpl.finishConnect(SocketChannelImpl.java:744)
    [junit] 	at org.jboss.netty.channel.socket.nio.NioClientBoss.connect(NioClientBoss.java:152)
    [junit] 	at org.jboss.netty.channel.socket.nio.NioClientBoss.processSelectedKeys(NioClientBoss.java:105)
    [junit] 	at org.jboss.netty.channel.socket.nio.NioClientBoss.process(NioClientBoss.java:79)
    [junit] 	at org.jboss.netty.channel.socket.nio.AbstractNioSelector.run(AbstractNioSelector.java:337)
    [junit] 	at org.jboss.netty.channel.socket.nio.NioClientBoss.run(NioClientBoss.java:42)
    [junit] 	at org.jboss.netty.util.ThreadRenamingRunnable.run(ThreadRenamingRunnable.java:108)
    [junit] 	at org.jboss.netty.util.internal.DeadLockProofWorker$1.run(DeadLockProofWorker.java:42)
    [junit] 	at java.util.concurrent.ThreadPoolExecutor.runWorker(ThreadPoolExecutor.java:1145)
    [junit] 	at java.util.concurrent.ThreadPoolExecutor$Worker.run(ThreadPoolExecutor.java:615)
    [junit] 	at java.lang.Thread.run(Thread.java:745)
    [junit] 2017-07-23 23:29:18,764 [myid:] - WARN  [New I/O boss #4917:ClientCnxnSocketNetty$ZKClientHandler@439]
- Exception caught: [id: 0xbcbdc1f8] EXCEPTION: java.net.ConnectException: Connection refused:
127.0.0.1/127.0.0.1:24736
    [junit] java.net.ConnectException: Connection refused: 127.0.0.1/127.0.0.1:24736
    [junit] 	at sun.nio.ch.SocketChannelImpl.checkConnect(Native Method)
    [junit] 	at sun.nio.ch.SocketChannelImpl.finishConnect(SocketChannelImpl.java:744)
    [junit] 	at org.jboss.netty.channel.socket.nio.NioClientBoss.connect(NioClientBoss.java:152)
    [junit] 	at org.jboss.netty.channel.socket.nio.NioClientBoss.processSelectedKeys(NioClientBoss.java:105)
    [junit] 	at org.jboss.netty.channel.socket.nio.NioClientBoss.process(NioClientBoss.java:79)
    [junit] 	at org.jboss.netty.channel.socket.nio.AbstractNioSelector.run(AbstractNioSelector.java:337)
    [junit] 	at org.jboss.netty.channel.socket.nio.NioClientBoss.run(NioClientBoss.java:42)
    [junit] 	at org.jboss.netty.util.ThreadRenamingRunnable.run(ThreadRenamingRunnable.java:108)
    [junit] 	at org.jboss.netty.util.internal.DeadLockProofWorker$1.run(DeadLockProofWorker.java:42)
    [junit] 	at java.util.concurrent.ThreadPoolExecutor.runWorker(ThreadPoolExecutor.java:1145)
    [junit] 	at java.util.concurrent.ThreadPoolExecutor$Worker.run(ThreadPoolExecutor.java:615)
    [junit] 	at java.lang.Thread.run(Thread.java:745)
    [junit] 2017-07-23 23:29:18,764 [myid:] - INFO  [New I/O boss #4917:ClientCnxnSocketNetty@208]
- channel is told closing
    [junit] 2017-07-23 23:29:18,764 [myid:127.0.0.1:24736] - INFO  [main-SendThread(127.0.0.1:24736):ClientCnxn$SendThread@1231]
- channel for sessionid 0x1005e6878630001 is lost, closing socket connection and attempting
reconnect

fail.build.on.test.failure:

BUILD FAILED
/home/jenkins/jenkins-slave/workspace/ZooKeeper-trunk/build.xml:1338: The following error
occurred while executing this line:
/home/jenkins/jenkins-slave/workspace/ZooKeeper-trunk/build.xml:1219: The following error
occurred while executing this line:
/home/jenkins/jenkins-slave/workspace/ZooKeeper-trunk/build.xml:1223: Tests failed!

Total time: 11 minutes 50 seconds
Build step 'Execute shell' marked build as failure
[FINDBUGS] Skipping publisher since build result is FAILURE
[WARNINGS] Skipping publisher since build result is FAILURE
Archiving artifacts
Setting JDK_1_7_LATEST__HOME=/home/jenkins/tools/java/latest1.7
Recording fingerprints
Setting JDK_1_7_LATEST__HOME=/home/jenkins/tools/java/latest1.7
Recording test results
Setting JDK_1_7_LATEST__HOME=/home/jenkins/tools/java/latest1.7
Publishing Javadoc
Setting JDK_1_7_LATEST__HOME=/home/jenkins/tools/java/latest1.7
Setting JDK_1_7_LATEST__HOME=/home/jenkins/tools/java/latest1.7
Email was triggered for: Failure - Any
Sending email for trigger: Failure - Any
Setting JDK_1_7_LATEST__HOME=/home/jenkins/tools/java/latest1.7
Setting JDK_1_7_LATEST__HOME=/home/jenkins/tools/java/latest1.7



###################################################################################
############################## FAILED TESTS (if any) ##############################
1 tests failed.
FAILED:  org.apache.zookeeper.server.quorum.ReconfigDuringLeaderSyncTest.testDuringLeaderSync

Error Message:
zoo.cfg.dynamic.next is not deleted.

Stack Trace:
junit.framework.AssertionFailedError: zoo.cfg.dynamic.next is not deleted.
	at org.apache.zookeeper.server.quorum.ReconfigDuringLeaderSyncTest.testDuringLeaderSync(ReconfigDuringLeaderSyncTest.java:165)
	at org.apache.zookeeper.JUnit4ZKTestRunner$LoggedInvokeMethod.evaluate(JUnit4ZKTestRunner.java:79)
Mime
  • Unnamed multipart/mixed (inline, None, 0 bytes)
View raw message