zookeeper-dev mailing list archives

Site index · List index
Message view « Date » · « Thread »
Top « Date » · « Thread »
From Apache Jenkins Server <jenk...@builds.apache.org>
Subject ZooKeeper-trunk-jdk8 - Build # 1115 - Still Failing
Date Tue, 04 Jul 2017 05:54:48 GMT
See https://builds.apache.org/job/ZooKeeper-trunk-jdk8/1115/

###################################################################################
########################## LAST 60 LINES OF THE CONSOLE ###########################
[...truncated 64.85 MB...]
    [junit] 	at java.lang.Thread.run(Thread.java:748)
    [junit] 2017-07-04 05:54:13,794 [myid:] - WARN  [New I/O boss #1971:ClientCnxnSocketNetty$ZKClientHandler@439]
- Exception caught: [id: 0x09a01465] EXCEPTION: java.net.ConnectException: Connection refused:
127.0.0.1/127.0.0.1:27444
    [junit] java.net.ConnectException: Connection refused: 127.0.0.1/127.0.0.1:27444
    [junit] 	at sun.nio.ch.SocketChannelImpl.checkConnect(Native Method)
    [junit] 	at sun.nio.ch.SocketChannelImpl.finishConnect(SocketChannelImpl.java:717)
    [junit] 	at org.jboss.netty.channel.socket.nio.NioClientBoss.connect(NioClientBoss.java:152)
    [junit] 	at org.jboss.netty.channel.socket.nio.NioClientBoss.processSelectedKeys(NioClientBoss.java:105)
    [junit] 	at org.jboss.netty.channel.socket.nio.NioClientBoss.process(NioClientBoss.java:79)
    [junit] 	at org.jboss.netty.channel.socket.nio.AbstractNioSelector.run(AbstractNioSelector.java:337)
    [junit] 	at org.jboss.netty.channel.socket.nio.NioClientBoss.run(NioClientBoss.java:42)
    [junit] 	at org.jboss.netty.util.ThreadRenamingRunnable.run(ThreadRenamingRunnable.java:108)
    [junit] 	at org.jboss.netty.util.internal.DeadLockProofWorker$1.run(DeadLockProofWorker.java:42)
    [junit] 	at java.util.concurrent.ThreadPoolExecutor.runWorker(ThreadPoolExecutor.java:1142)
    [junit] 	at java.util.concurrent.ThreadPoolExecutor$Worker.run(ThreadPoolExecutor.java:617)
    [junit] 	at java.lang.Thread.run(Thread.java:748)
    [junit] 2017-07-04 05:54:13,794 [myid:] - INFO  [New I/O boss #1971:ClientCnxnSocketNetty@208]
- channel is told closing
    [junit] 2017-07-04 05:54:13,794 [myid:127.0.0.1:27444] - INFO  [main-SendThread(127.0.0.1:27444):ClientCnxn$SendThread@1231]
- channel for sessionid 0x102c88134910000 is lost, closing socket connection and attempting
reconnect
    [junit] 2017-07-04 05:54:14,140 [myid:] - INFO  [ProcessThread(sid:0 cport:27626)::PrepRequestProcessor@614]
- Processed session termination for sessionid: 0x102c8868c2a0000
    [junit] 2017-07-04 05:54:14,141 [myid:] - INFO  [main:ClientCnxnSocketNetty@208] - channel
is told closing
    [junit] 2017-07-04 05:54:14,142 [myid:] - INFO  [New I/O worker #4414:ClientCnxnSocketNetty$ZKClientHandler@384]
- channel is disconnected: [id: 0x1969ddf6, /127.0.0.1:46817 :> 127.0.0.1/127.0.0.1:27626]
    [junit] 2017-07-04 05:54:14,142 [myid:] - INFO  [New I/O worker #4414:ClientCnxnSocketNetty@208]
- channel is told closing
    [junit] 2017-07-04 05:54:14,142 [myid:] - INFO  [SyncThread:0:MBeanRegistry@128] - Unregister
MBean [org.apache.ZooKeeperService:name0=StandaloneServer_port27626,name1=Connections,name2=127.0.0.1,name3=0x102c8868c2a0000]
    [junit] 2017-07-04 05:54:14,142 [myid:] - INFO  [main:ZooKeeper@1329] - Session: 0x102c8868c2a0000
closed
    [junit] 2017-07-04 05:54:14,142 [myid:] - INFO  [main-EventThread:ClientCnxn$EventThread@513]
- EventThread shut down for session: 0x102c8868c2a0000
    [junit] 2017-07-04 05:54:14,143 [myid:] - INFO  [main:JUnit4ZKTestRunner$LoggedInvokeMethod@82]
- Memory used 139565
    [junit] 2017-07-04 05:54:14,143 [myid:] - INFO  [main:JUnit4ZKTestRunner$LoggedInvokeMethod@87]
- Number of threads 530
    [junit] 2017-07-04 05:54:14,143 [myid:] - INFO  [main:JUnit4ZKTestRunner$LoggedInvokeMethod@102]
- FINISHED TEST METHOD testWatcherAutoResetWithLocal
    [junit] 2017-07-04 05:54:14,143 [myid:] - INFO  [main:ClientBase@601] - tearDown starting
    [junit] 2017-07-04 05:54:14,143 [myid:] - INFO  [main:ClientBase@571] - STOPPING server
    [junit] 2017-07-04 05:54:14,144 [myid:] - INFO  [main:NettyServerCnxnFactory@464] - shutdown
called 0.0.0.0/0.0.0.0:27626
    [junit] 2017-07-04 05:54:14,145 [myid:] - INFO  [main:ZooKeeperServer@541] - shutting
down
    [junit] 2017-07-04 05:54:14,145 [myid:] - ERROR [main:ZooKeeperServer@505] - ZKShutdownHandler
is not registered, so ZooKeeper server won't take any action on ERROR or SHUTDOWN server state
changes
    [junit] 2017-07-04 05:54:14,145 [myid:] - INFO  [main:SessionTrackerImpl@232] - Shutting
down
    [junit] 2017-07-04 05:54:14,145 [myid:] - INFO  [main:PrepRequestProcessor@1008] - Shutting
down
    [junit] 2017-07-04 05:54:14,146 [myid:] - INFO  [main:SyncRequestProcessor@191] - Shutting
down
    [junit] 2017-07-04 05:54:14,146 [myid:] - INFO  [ProcessThread(sid:0 cport:27626)::PrepRequestProcessor@155]
- PrepRequestProcessor exited loop!
    [junit] 2017-07-04 05:54:14,146 [myid:] - INFO  [SyncThread:0:SyncRequestProcessor@169]
- SyncRequestProcessor exited!
    [junit] 2017-07-04 05:54:14,148 [myid:] - INFO  [main:FinalRequestProcessor@481] - shutdown
of request processor complete
    [junit] 2017-07-04 05:54:14,148 [myid:] - INFO  [main:MBeanRegistry@128] - Unregister
MBean [org.apache.ZooKeeperService:name0=StandaloneServer_port27626,name1=InMemoryDataTree]
    [junit] 2017-07-04 05:54:14,148 [myid:] - INFO  [main:MBeanRegistry@128] - Unregister
MBean [org.apache.ZooKeeperService:name0=StandaloneServer_port27626]
    [junit] 2017-07-04 05:54:14,151 [myid:] - INFO  [main:FourLetterWordMain@85] - connecting
to 127.0.0.1 27626
    [junit] 2017-07-04 05:54:14,152 [myid:] - INFO  [main:JMXEnv@146] - ensureOnly:[]
    [junit] 2017-07-04 05:54:14,155 [myid:] - INFO  [main:ClientBase@626] - fdcount after
test is: 1529 at start it was 1529
    [junit] 2017-07-04 05:54:14,155 [myid:] - INFO  [main:ZKTestCase$1@68] - SUCCEEDED testWatcherAutoResetWithLocal
    [junit] 2017-07-04 05:54:14,155 [myid:] - INFO  [main:ZKTestCase$1@63] - FINISHED testWatcherAutoResetWithLocal
    [junit] Tests run: 103, Failures: 0, Errors: 0, Skipped: 0, Time elapsed: 395.323 sec,
Thread: 7, Class: org.apache.zookeeper.test.NettyNettySuiteTest

fail.build.on.test.failure:

BUILD FAILED
/home/jenkins/jenkins-slave/workspace/ZooKeeper-trunk-jdk8/build.xml:1219: The following error
occurred while executing this line:
/home/jenkins/jenkins-slave/workspace/ZooKeeper-trunk-jdk8/build.xml:1223: Tests failed!

Total time: 9 minutes 53 seconds
Build step 'Invoke Ant' marked build as failure
[WARNINGS] Skipping publisher since build result is FAILURE
Recording test results
Email was triggered for: Failure - Any
Sending email for trigger: Failure - Any



###################################################################################
############################## FAILED TESTS (if any) ##############################
1 tests failed.
FAILED:  org.apache.zookeeper.test.WatchEventWhenAutoResetTest.testNodeDataChanged

Error Message:
expected:<NodeDataChanged> but was:<NodeDeleted>

Stack Trace:
junit.framework.AssertionFailedError: expected:<NodeDataChanged> but was:<NodeDeleted>
	at org.apache.zookeeper.test.WatchEventWhenAutoResetTest$EventsWatcher.assertEvent(WatchEventWhenAutoResetTest.java:67)
	at org.apache.zookeeper.test.WatchEventWhenAutoResetTest.testNodeDataChanged(WatchEventWhenAutoResetTest.java:117)
	at org.apache.zookeeper.JUnit4ZKTestRunner$LoggedInvokeMethod.evaluate(JUnit4ZKTestRunner.java:79)
Mime
  • Unnamed multipart/mixed (inline, None, 0 bytes)
View raw message