zookeeper-dev mailing list archives

Site index · List index
Message view « Date » · « Thread »
Top « Date » · « Thread »
From Apache Jenkins Server <jenk...@builds.apache.org>
Subject ZooKeeper-trunk-openjdk7 - Build # 1560 - Still Failing
Date Thu, 27 Jul 2017 22:58:48 GMT
See https://builds.apache.org/job/ZooKeeper-trunk-openjdk7/1560/

###################################################################################
########################## LAST 60 LINES OF THE CONSOLE ###########################
[...truncated 61.78 MB...]
    [junit] 	at org.apache.zookeeper.ClientCnxnSocketNIO.doTransport(ClientCnxnSocketNIO.java:357)
    [junit] 	at org.apache.zookeeper.ClientCnxn$SendThread.run(ClientCnxn.java:1214)
    [junit] 2017-07-27 22:58:07,431 [myid:127.0.0.1:27396] - INFO  [main-SendThread(127.0.0.1:27396):ClientCnxn$SendThread@1113]
- Opening socket connection to server 127.0.0.1/127.0.0.1:27396. Will not attempt to authenticate
using SASL (unknown error)
    [junit] 2017-07-27 22:58:07,432 [myid:127.0.0.1:27396] - WARN  [main-SendThread(127.0.0.1:27396):ClientCnxn$SendThread@1235]
- Session 0x305b12efad00000 for server 127.0.0.1/127.0.0.1:27396, unexpected error, closing
socket connection and attempting reconnect
    [junit] java.net.ConnectException: Connection refused
    [junit] 	at sun.nio.ch.SocketChannelImpl.checkConnect(Native Method)
    [junit] 	at sun.nio.ch.SocketChannelImpl.finishConnect(SocketChannelImpl.java:739)
    [junit] 	at org.apache.zookeeper.ClientCnxnSocketNIO.doTransport(ClientCnxnSocketNIO.java:357)
    [junit] 	at org.apache.zookeeper.ClientCnxn$SendThread.run(ClientCnxn.java:1214)
    [junit] 2017-07-27 22:58:08,571 [myid:127.0.0.1:27396] - INFO  [main-SendThread(127.0.0.1:27396):ClientCnxn$SendThread@1113]
- Opening socket connection to server 127.0.0.1/127.0.0.1:27396. Will not attempt to authenticate
using SASL (unknown error)
    [junit] 2017-07-27 22:58:08,571 [myid:127.0.0.1:27396] - WARN  [main-SendThread(127.0.0.1:27396):ClientCnxn$SendThread@1235]
- Session 0x305b12efad00000 for server 127.0.0.1/127.0.0.1:27396, unexpected error, closing
socket connection and attempting reconnect
    [junit] java.net.ConnectException: Connection refused
    [junit] 	at sun.nio.ch.SocketChannelImpl.checkConnect(Native Method)
    [junit] 	at sun.nio.ch.SocketChannelImpl.finishConnect(SocketChannelImpl.java:739)
    [junit] 	at org.apache.zookeeper.ClientCnxnSocketNIO.doTransport(ClientCnxnSocketNIO.java:357)
    [junit] 	at org.apache.zookeeper.ClientCnxn$SendThread.run(ClientCnxn.java:1214)
    [junit] 2017-07-27 22:58:10,598 [myid:127.0.0.1:27396] - INFO  [main-SendThread(127.0.0.1:27396):ClientCnxn$SendThread@1113]
- Opening socket connection to server 127.0.0.1/127.0.0.1:27396. Will not attempt to authenticate
using SASL (unknown error)
    [junit] 2017-07-27 22:58:10,598 [myid:127.0.0.1:27396] - WARN  [main-SendThread(127.0.0.1:27396):ClientCnxn$SendThread@1235]
- Session 0x305b12efad00000 for server 127.0.0.1/127.0.0.1:27396, unexpected error, closing
socket connection and attempting reconnect
    [junit] java.net.ConnectException: Connection refused
    [junit] 	at sun.nio.ch.SocketChannelImpl.checkConnect(Native Method)
    [junit] 	at sun.nio.ch.SocketChannelImpl.finishConnect(SocketChannelImpl.java:739)
    [junit] 	at org.apache.zookeeper.ClientCnxnSocketNIO.doTransport(ClientCnxnSocketNIO.java:357)
    [junit] 	at org.apache.zookeeper.ClientCnxn$SendThread.run(ClientCnxn.java:1214)
    [junit] 2017-07-27 22:58:11,996 [myid:127.0.0.1:27396] - INFO  [main-SendThread(127.0.0.1:27396):ClientCnxn$SendThread@1113]
- Opening socket connection to server 127.0.0.1/127.0.0.1:27396. Will not attempt to authenticate
using SASL (unknown error)
    [junit] 2017-07-27 22:58:11,997 [myid:127.0.0.1:27396] - WARN  [main-SendThread(127.0.0.1:27396):ClientCnxn$SendThread@1235]
- Session 0x305b12efad00000 for server 127.0.0.1/127.0.0.1:27396, unexpected error, closing
socket connection and attempting reconnect
    [junit] java.net.ConnectException: Connection refused
    [junit] 	at sun.nio.ch.SocketChannelImpl.checkConnect(Native Method)
    [junit] 	at sun.nio.ch.SocketChannelImpl.finishConnect(SocketChannelImpl.java:739)
    [junit] 	at org.apache.zookeeper.ClientCnxnSocketNIO.doTransport(ClientCnxnSocketNIO.java:357)
    [junit] 	at org.apache.zookeeper.ClientCnxn$SendThread.run(ClientCnxn.java:1214)
    [junit] 2017-07-27 22:58:13,348 [myid:127.0.0.1:27396] - INFO  [main-SendThread(127.0.0.1:27396):ClientCnxn$SendThread@1113]
- Opening socket connection to server 127.0.0.1/127.0.0.1:27396. Will not attempt to authenticate
using SASL (unknown error)
    [junit] 2017-07-27 22:58:13,348 [myid:127.0.0.1:27396] - WARN  [main-SendThread(127.0.0.1:27396):ClientCnxn$SendThread@1235]
- Session 0x305b12efad00000 for server 127.0.0.1/127.0.0.1:27396, unexpected error, closing
socket connection and attempting reconnect
    [junit] java.net.ConnectException: Connection refused
    [junit] 	at sun.nio.ch.SocketChannelImpl.checkConnect(Native Method)
    [junit] 	at sun.nio.ch.SocketChannelImpl.finishConnect(SocketChannelImpl.java:739)
    [junit] 	at org.apache.zookeeper.ClientCnxnSocketNIO.doTransport(ClientCnxnSocketNIO.java:357)
    [junit] 	at org.apache.zookeeper.ClientCnxn$SendThread.run(ClientCnxn.java:1214)
    [junit] 2017-07-27 22:58:15,269 [myid:127.0.0.1:27396] - INFO  [main-SendThread(127.0.0.1:27396):ClientCnxn$SendThread@1113]
- Opening socket connection to server 127.0.0.1/127.0.0.1:27396. Will not attempt to authenticate
using SASL (unknown error)
    [junit] 2017-07-27 22:58:15,270 [myid:127.0.0.1:27396] - WARN  [main-SendThread(127.0.0.1:27396):ClientCnxn$SendThread@1235]
- Session 0x305b12efad00000 for server 127.0.0.1/127.0.0.1:27396, unexpected error, closing
socket connection and attempting reconnect
    [junit] java.net.ConnectException: Connection refused
    [junit] 	at sun.nio.ch.SocketChannelImpl.checkConnect(Native Method)
    [junit] 	at sun.nio.ch.SocketChannelImpl.finishConnect(SocketChannelImpl.java:739)
    [junit] 	at org.apache.zookeeper.ClientCnxnSocketNIO.doTransport(ClientCnxnSocketNIO.java:357)
    [junit] 	at org.apache.zookeeper.ClientCnxn$SendThread.run(ClientCnxn.java:1214)
    [junit] Running org.apache.zookeeper.test.ObserverTest in thread 7
    [junit] Tests run: 1, Failures: 0, Errors: 1, Skipped: 0, Time elapsed: 0 sec, Thread:
7, Class: org.apache.zookeeper.test.ObserverTest
    [junit] Test org.apache.zookeeper.test.ObserverTest FAILED (timeout)

fail.build.on.test.failure:

BUILD FAILED
/home/jenkins/jenkins-slave/workspace/ZooKeeper-trunk-openjdk7/build.xml:1220: The following
error occurred while executing this line:
/home/jenkins/jenkins-slave/workspace/ZooKeeper-trunk-openjdk7/build.xml:1224: Tests failed!

Total time: 18 minutes 42 seconds
Build step 'Invoke Ant' marked build as failure
Recording test results
Email was triggered for: Failure - Any
Sending email for trigger: Failure - Any



###################################################################################
############################## FAILED TESTS (if any) ##############################
70 tests failed.
FAILED:  org.apache.zookeeper.test.LocalSessionRequestTest.testLocalSessionsOnFollower

Error Message:
waiting for server up

Stack Trace:
junit.framework.AssertionFailedError: waiting for server up
	at org.apache.zookeeper.test.QuorumBase.startServers(QuorumBase.java:223)
	at org.apache.zookeeper.test.QuorumBase.setUp(QuorumBase.java:120)
	at org.apache.zookeeper.test.QuorumBase.setUp(QuorumBase.java:78)
	at org.apache.zookeeper.test.LocalSessionRequestTest.setUp(LocalSessionRequestTest.java:53)


FAILED:  org.apache.zookeeper.test.AsyncHammerTest.testObserversHammer

Error Message:
unable to create new native thread

Stack Trace:
java.lang.OutOfMemoryError: unable to create new native thread
	at java.lang.Thread.start0(Native Method)
	at java.lang.Thread.start(Thread.java:714)
	at org.apache.zookeeper.test.AsyncHammerTest.testObserversHammer(AsyncHammerTest.java:207)
	at org.apache.zookeeper.JUnit4ZKTestRunner$LoggedInvokeMethod.evaluate(JUnit4ZKTestRunner.java:79)


FAILED:  org.apache.zookeeper.test.NioNettySuiteTest.unknown

Error Message:
Forked Java VM exited abnormally. Please note the time in the report does not reflect the
time until the VM exit.

Stack Trace:
junit.framework.AssertionFailedError: Forked Java VM exited abnormally. Please note the time
in the report does not reflect the time until the VM exit.
	at java.lang.Thread.run(Thread.java:745)


FAILED:  org.apache.zookeeper.test.NonRecoverableErrorTest.unknown

Error Message:
Forked Java VM exited abnormally. Please note the time in the report does not reflect the
time until the VM exit.

Stack Trace:
junit.framework.AssertionFailedError: Forked Java VM exited abnormally. Please note the time
in the report does not reflect the time until the VM exit.
	at java.lang.Thread.run(Thread.java:745)


FAILED:  org.apache.zookeeper.test.OOMTest.unknown

Error Message:
Forked Java VM exited abnormally. Please note the time in the report does not reflect the
time until the VM exit.

Stack Trace:
junit.framework.AssertionFailedError: Forked Java VM exited abnormally. Please note the time
in the report does not reflect the time until the VM exit.
	at java.lang.Thread.run(Thread.java:745)


FAILED:  org.apache.zookeeper.test.ObserverTest.testObserver

Error Message:
Timeout occurred. Please note the time in the report does not reflect the time until the timeout.

Stack Trace:
junit.framework.AssertionFailedError: Timeout occurred. Please note the time in the report
does not reflect the time until the timeout.
	at java.lang.Thread.run(Thread.java:745)


FAILED:  org.apache.zookeeper.test.NullDataTest.unknown

Error Message:
Forked Java VM exited abnormally. Please note the time in the report does not reflect the
time until the VM exit.

Stack Trace:
junit.framework.AssertionFailedError: Forked Java VM exited abnormally. Please note the time
in the report does not reflect the time until the VM exit.
	at java.lang.Thread.run(Thread.java:745)


FAILED:  org.apache.zookeeper.server.quorum.ReconfigRecoveryTest.testCurrentObserverIsParticipantInNewConfig

Error Message:
waiting for server 2 being up

Stack Trace:
junit.framework.AssertionFailedError: waiting for server 2 being up
	at org.apache.zookeeper.server.quorum.ReconfigRecoveryTest.testCurrentObserverIsParticipantInNewConfig(ReconfigRecoveryTest.java:535)
	at org.apache.zookeeper.JUnit4ZKTestRunner$LoggedInvokeMethod.evaluate(JUnit4ZKTestRunner.java:79)


FAILED:  org.apache.zookeeper.test.AsyncHammerTest.testHammer

Error Message:
null

Stack Trace:
junit.framework.AssertionFailedError
	at org.apache.zookeeper.test.AsyncHammerTest.testHammer(AsyncHammerTest.java:185)
	at org.apache.zookeeper.JUnit4ZKTestRunner$LoggedInvokeMethod.evaluate(JUnit4ZKTestRunner.java:79)


FAILED:  org.apache.zookeeper.test.AsyncOpsTest.testAsyncSetDataFailure_BadVersion

Error Message:
null

Stack Trace:
java.lang.NullPointerException
	at org.apache.zookeeper.test.AsyncOpsTest.tearDown(AsyncOpsTest.java:59)


FAILED:  org.apache.zookeeper.test.AsyncOpsTest.testAsyncGetChildrenFailure_NoNode

Error Message:
null

Stack Trace:
java.lang.NullPointerException
	at org.apache.zookeeper.test.AsyncOpsTest.tearDown(AsyncOpsTest.java:59)


FAILED:  org.apache.zookeeper.test.AsyncOpsTest.testAsyncCreate2

Error Message:
null

Stack Trace:
java.lang.NullPointerException
	at org.apache.zookeeper.test.AsyncOpsTest.tearDown(AsyncOpsTest.java:59)


FAILED:  org.apache.zookeeper.test.AsyncOpsTest.testAsyncExistsFailure_NoNode

Error Message:
null

Stack Trace:
java.lang.NullPointerException
	at org.apache.zookeeper.test.AsyncOpsTest.tearDown(AsyncOpsTest.java:59)


FAILED:  org.apache.zookeeper.test.AsyncOpsTest.testAsyncGetChildren2Empty

Error Message:
null

Stack Trace:
java.lang.NullPointerException
	at org.apache.zookeeper.test.AsyncOpsTest.tearDown(AsyncOpsTest.java:59)


FAILED:  org.apache.zookeeper.test.AsyncOpsTest.testAsyncCreateThree

Error Message:
null

Stack Trace:
java.lang.NullPointerException
	at org.apache.zookeeper.test.AsyncOpsTest.tearDown(AsyncOpsTest.java:59)


FAILED:  org.apache.zookeeper.test.AsyncOpsTest.testAsyncMultiFailure_AllErrorResult

Error Message:
null

Stack Trace:
java.lang.NullPointerException
	at org.apache.zookeeper.test.AsyncOpsTest.tearDown(AsyncOpsTest.java:59)


FAILED:  org.apache.zookeeper.test.AsyncOpsTest.testAsyncGetChildrenTwo

Error Message:
null

Stack Trace:
java.lang.NullPointerException
	at org.apache.zookeeper.test.AsyncOpsTest.tearDown(AsyncOpsTest.java:59)


FAILED:  org.apache.zookeeper.test.AsyncOpsTest.testAsyncCreateFailure_NodeExists

Error Message:
null

Stack Trace:
java.lang.NullPointerException
	at org.apache.zookeeper.test.AsyncOpsTest.tearDown(AsyncOpsTest.java:59)


FAILED:  org.apache.zookeeper.test.AsyncOpsTest.testAsyncCreate2Failure_NoChildForEphemeral

Error Message:
null

Stack Trace:
java.lang.NullPointerException
	at org.apache.zookeeper.test.AsyncOpsTest.tearDown(AsyncOpsTest.java:59)


FAILED:  org.apache.zookeeper.test.AsyncOpsTest.testAsyncSetData

Error Message:
null

Stack Trace:
java.lang.NullPointerException
	at org.apache.zookeeper.test.AsyncOpsTest.tearDown(AsyncOpsTest.java:59)


FAILED:  org.apache.zookeeper.test.AsyncOpsTest.testAsyncSetDataFailure_NoNode

Error Message:
null

Stack Trace:
java.lang.NullPointerException
	at org.apache.zookeeper.test.AsyncOpsTest.tearDown(AsyncOpsTest.java:59)


FAILED:  org.apache.zookeeper.test.AsyncOpsTest.testAsyncSetACLFailure_NoNode

Error Message:
null

Stack Trace:
java.lang.NullPointerException
	at org.apache.zookeeper.test.AsyncOpsTest.tearDown(AsyncOpsTest.java:59)


FAILED:  org.apache.zookeeper.test.AsyncOpsTest.testAsyncDeleteFailure_NotEmpty

Error Message:
null

Stack Trace:
java.lang.NullPointerException
	at org.apache.zookeeper.test.AsyncOpsTest.tearDown(AsyncOpsTest.java:59)


FAILED:  org.apache.zookeeper.test.AsyncOpsTest.testAsyncGetChildrenSingle

Error Message:
null

Stack Trace:
java.lang.NullPointerException
	at org.apache.zookeeper.test.AsyncOpsTest.tearDown(AsyncOpsTest.java:59)


FAILED:  org.apache.zookeeper.test.AsyncOpsTest.testAsyncCreate2Failure_NodeExists

Error Message:
null

Stack Trace:
java.lang.NullPointerException
	at org.apache.zookeeper.test.AsyncOpsTest.tearDown(AsyncOpsTest.java:59)


FAILED:  org.apache.zookeeper.test.AsyncOpsTest.testAsyncGetACLFailure_NoNode

Error Message:
null

Stack Trace:
java.lang.NullPointerException
	at org.apache.zookeeper.test.AsyncOpsTest.tearDown(AsyncOpsTest.java:59)


FAILED:  org.apache.zookeeper.test.AsyncOpsTest.testAsyncGetChildren2Single

Error Message:
null

Stack Trace:
java.lang.NullPointerException
	at org.apache.zookeeper.test.AsyncOpsTest.tearDown(AsyncOpsTest.java:59)


FAILED:  org.apache.zookeeper.test.ChrootClientTest.testPing

Error Message:
Unexpected bean exists! expected:<0> but was:<36>

Stack Trace:
junit.framework.AssertionFailedError: Unexpected bean exists! expected:<0> but was:<36>
	at org.apache.zookeeper.test.ClientBase.verifyUnexpectedBeans(ClientBase.java:556)
	at org.apache.zookeeper.test.ClientBase.startServer(ClientBase.java:535)
	at org.apache.zookeeper.test.ClientBase.setUp(ClientBase.java:518)
	at org.apache.zookeeper.test.ChrootClientTest.setUp(ChrootClientTest.java:37)


FAILED:  org.apache.zookeeper.test.ChrootClientTest.testTryWithResources

Error Message:
Unexpected bean exists! expected:<0> but was:<36>

Stack Trace:
junit.framework.AssertionFailedError: Unexpected bean exists! expected:<0> but was:<36>
	at org.apache.zookeeper.test.ClientBase.verifyUnexpectedBeans(ClientBase.java:556)
	at org.apache.zookeeper.test.ClientBase.startServer(ClientBase.java:535)
	at org.apache.zookeeper.test.ClientBase.setUp(ClientBase.java:518)
	at org.apache.zookeeper.test.ChrootClientTest.setUp(ChrootClientTest.java:37)


FAILED:  org.apache.zookeeper.test.ChrootClientTest.testACLs

Error Message:
Unexpected bean exists! expected:<0> but was:<36>

Stack Trace:
junit.framework.AssertionFailedError: Unexpected bean exists! expected:<0> but was:<36>
	at org.apache.zookeeper.test.ClientBase.verifyUnexpectedBeans(ClientBase.java:556)
	at org.apache.zookeeper.test.ClientBase.startServer(ClientBase.java:535)
	at org.apache.zookeeper.test.ClientBase.setUp(ClientBase.java:518)
	at org.apache.zookeeper.test.ChrootClientTest.setUp(ChrootClientTest.java:37)


FAILED:  org.apache.zookeeper.test.ChrootClientTest.testClientCleanup

Error Message:
Unexpected bean exists! expected:<0> but was:<36>

Stack Trace:
junit.framework.AssertionFailedError: Unexpected bean exists! expected:<0> but was:<36>
	at org.apache.zookeeper.test.ClientBase.verifyUnexpectedBeans(ClientBase.java:556)
	at org.apache.zookeeper.test.ClientBase.startServer(ClientBase.java:535)
	at org.apache.zookeeper.test.ClientBase.setUp(ClientBase.java:518)
	at org.apache.zookeeper.test.ChrootClientTest.setUp(ChrootClientTest.java:37)


FAILED:  org.apache.zookeeper.test.ChrootClientTest.testClientwithoutWatcherObj

Error Message:
Unexpected bean exists! expected:<0> but was:<36>

Stack Trace:
junit.framework.AssertionFailedError: Unexpected bean exists! expected:<0> but was:<36>
	at org.apache.zookeeper.test.ClientBase.verifyUnexpectedBeans(ClientBase.java:556)
	at org.apache.zookeeper.test.ClientBase.startServer(ClientBase.java:535)
	at org.apache.zookeeper.test.ClientBase.setUp(ClientBase.java:518)
	at org.apache.zookeeper.test.ChrootClientTest.setUp(ChrootClientTest.java:37)


FAILED:  org.apache.zookeeper.test.ChrootClientTest.testSequentialNodeData

Error Message:
Unexpected bean exists! expected:<0> but was:<36>

Stack Trace:
junit.framework.AssertionFailedError: Unexpected bean exists! expected:<0> but was:<36>
	at org.apache.zookeeper.test.ClientBase.verifyUnexpectedBeans(ClientBase.java:556)
	at org.apache.zookeeper.test.ClientBase.startServer(ClientBase.java:535)
	at org.apache.zookeeper.test.ClientBase.setUp(ClientBase.java:518)
	at org.apache.zookeeper.test.ChrootClientTest.setUp(ChrootClientTest.java:37)


FAILED:  org.apache.zookeeper.test.ChrootClientTest.testSequentialNodeNames

Error Message:
Unexpected bean exists! expected:<0> but was:<36>

Stack Trace:
junit.framework.AssertionFailedError: Unexpected bean exists! expected:<0> but was:<36>
	at org.apache.zookeeper.test.ClientBase.verifyUnexpectedBeans(ClientBase.java:556)
	at org.apache.zookeeper.test.ClientBase.startServer(ClientBase.java:535)
	at org.apache.zookeeper.test.ClientBase.setUp(ClientBase.java:518)
	at org.apache.zookeeper.test.ChrootClientTest.setUp(ChrootClientTest.java:37)


FAILED:  org.apache.zookeeper.test.ChrootClientTest.testClientWithWatcherObj

Error Message:
Unexpected bean exists! expected:<0> but was:<36>

Stack Trace:
junit.framework.AssertionFailedError: Unexpected bean exists! expected:<0> but was:<36>
	at org.apache.zookeeper.test.ClientBase.verifyUnexpectedBeans(ClientBase.java:556)
	at org.apache.zookeeper.test.ClientBase.startServer(ClientBase.java:535)
	at org.apache.zookeeper.test.ClientBase.setUp(ClientBase.java:518)
	at org.apache.zookeeper.test.ChrootClientTest.setUp(ChrootClientTest.java:37)


FAILED:  org.apache.zookeeper.test.ChrootClientTest.testTestability

Error Message:
Unexpected bean exists! expected:<0> but was:<36>

Stack Trace:
junit.framework.AssertionFailedError: Unexpected bean exists! expected:<0> but was:<36>
	at org.apache.zookeeper.test.ClientBase.verifyUnexpectedBeans(ClientBase.java:556)
	at org.apache.zookeeper.test.ClientBase.startServer(ClientBase.java:535)
	at org.apache.zookeeper.test.ClientBase.setUp(ClientBase.java:518)
	at org.apache.zookeeper.test.ChrootClientTest.setUp(ChrootClientTest.java:37)


FAILED:  org.apache.zookeeper.test.ChrootClientTest.testNullAuthId

Error Message:
Unexpected bean exists! expected:<0> but was:<36>

Stack Trace:
junit.framework.AssertionFailedError: Unexpected bean exists! expected:<0> but was:<36>
	at org.apache.zookeeper.test.ClientBase.verifyUnexpectedBeans(ClientBase.java:556)
	at org.apache.zookeeper.test.ClientBase.startServer(ClientBase.java:535)
	at org.apache.zookeeper.test.ClientBase.setUp(ClientBase.java:518)
	at org.apache.zookeeper.test.ChrootClientTest.setUp(ChrootClientTest.java:37)


FAILED:  org.apache.zookeeper.test.ChrootClientTest.testNonExistingOpCode

Error Message:
Unexpected bean exists! expected:<0> but was:<36>

Stack Trace:
junit.framework.AssertionFailedError: Unexpected bean exists! expected:<0> but was:<36>
	at org.apache.zookeeper.test.ClientBase.verifyUnexpectedBeans(ClientBase.java:556)
	at org.apache.zookeeper.test.ClientBase.startServer(ClientBase.java:535)
	at org.apache.zookeeper.test.ClientBase.setUp(ClientBase.java:518)
	at org.apache.zookeeper.test.ChrootClientTest.setUp(ChrootClientTest.java:37)


FAILED:  org.apache.zookeeper.test.ChrootClientTest.testDeleteWithChildren

Error Message:
Unexpected bean exists! expected:<0> but was:<36>

Stack Trace:
junit.framework.AssertionFailedError: Unexpected bean exists! expected:<0> but was:<36>
	at org.apache.zookeeper.test.ClientBase.verifyUnexpectedBeans(ClientBase.java:556)
	at org.apache.zookeeper.test.ClientBase.startServer(ClientBase.java:535)
	at org.apache.zookeeper.test.ClientBase.setUp(ClientBase.java:518)
	at org.apache.zookeeper.test.ChrootClientTest.setUp(ChrootClientTest.java:37)


FAILED:  org.apache.zookeeper.test.ChrootClientTest.testPathValidation

Error Message:
Unexpected bean exists! expected:<0> but was:<36>

Stack Trace:
junit.framework.AssertionFailedError: Unexpected bean exists! expected:<0> but was:<36>
	at org.apache.zookeeper.test.ClientBase.verifyUnexpectedBeans(ClientBase.java:556)
	at org.apache.zookeeper.test.ClientBase.startServer(ClientBase.java:535)
	at org.apache.zookeeper.test.ClientBase.setUp(ClientBase.java:518)
	at org.apache.zookeeper.test.ChrootClientTest.setUp(ChrootClientTest.java:37)


FAILED:  org.apache.zookeeper.test.ChrootClientTest.testLargeNodeData

Error Message:
Unexpected bean exists! expected:<0> but was:<36>

Stack Trace:
junit.framework.AssertionFailedError: Unexpected bean exists! expected:<0> but was:<36>
	at org.apache.zookeeper.test.ClientBase.verifyUnexpectedBeans(ClientBase.java:556)
	at org.apache.zookeeper.test.ClientBase.startServer(ClientBase.java:535)
	at org.apache.zookeeper.test.ClientBase.setUp(ClientBase.java:518)
	at org.apache.zookeeper.test.ChrootClientTest.setUp(ChrootClientTest.java:37)


FAILED:  org.apache.zookeeper.test.ChrootClientTest.testMutipleWatcherObjs

Error Message:
Unexpected bean exists! expected:<0> but was:<36>

Stack Trace:
junit.framework.AssertionFailedError: Unexpected bean exists! expected:<0> but was:<36>
	at org.apache.zookeeper.test.ClientBase.verifyUnexpectedBeans(ClientBase.java:556)
	at org.apache.zookeeper.test.ClientBase.startServer(ClientBase.java:535)
	at org.apache.zookeeper.test.ClientBase.setUp(ClientBase.java:518)
	at org.apache.zookeeper.test.ChrootClientTest.setUp(ChrootClientTest.java:37)


FAILED:  org.apache.zookeeper.test.ClientTest.testTryWithResources

Error Message:
Unexpected bean exists! expected:<0> but was:<36>

Stack Trace:
junit.framework.AssertionFailedError: Unexpected bean exists! expected:<0> but was:<36>
	at org.apache.zookeeper.test.ClientBase.verifyUnexpectedBeans(ClientBase.java:556)
	at org.apache.zookeeper.test.ClientBase.startServer(ClientBase.java:535)
	at org.apache.zookeeper.test.ClientBase.setUp(ClientBase.java:518)


FAILED:  org.apache.zookeeper.test.ClientTest.testACLs

Error Message:
Unexpected bean exists! expected:<0> but was:<36>

Stack Trace:
junit.framework.AssertionFailedError: Unexpected bean exists! expected:<0> but was:<36>
	at org.apache.zookeeper.test.ClientBase.verifyUnexpectedBeans(ClientBase.java:556)
	at org.apache.zookeeper.test.ClientBase.startServer(ClientBase.java:535)
	at org.apache.zookeeper.test.ClientBase.setUp(ClientBase.java:518)


FAILED:  org.apache.zookeeper.test.ClientTest.testPing

Error Message:
Unexpected bean exists! expected:<0> but was:<36>

Stack Trace:
junit.framework.AssertionFailedError: Unexpected bean exists! expected:<0> but was:<36>
	at org.apache.zookeeper.test.ClientBase.verifyUnexpectedBeans(ClientBase.java:556)
	at org.apache.zookeeper.test.ClientBase.startServer(ClientBase.java:535)
	at org.apache.zookeeper.test.ClientBase.setUp(ClientBase.java:518)


FAILED:  org.apache.zookeeper.test.ClientTest.testClientCleanup

Error Message:
Unexpected bean exists! expected:<0> but was:<36>

Stack Trace:
junit.framework.AssertionFailedError: Unexpected bean exists! expected:<0> but was:<36>
	at org.apache.zookeeper.test.ClientBase.verifyUnexpectedBeans(ClientBase.java:556)
	at org.apache.zookeeper.test.ClientBase.startServer(ClientBase.java:535)
	at org.apache.zookeeper.test.ClientBase.setUp(ClientBase.java:518)


FAILED:  org.apache.zookeeper.test.ClientTest.testClientwithoutWatcherObj

Error Message:
Unexpected bean exists! expected:<0> but was:<36>

Stack Trace:
junit.framework.AssertionFailedError: Unexpected bean exists! expected:<0> but was:<36>
	at org.apache.zookeeper.test.ClientBase.verifyUnexpectedBeans(ClientBase.java:556)
	at org.apache.zookeeper.test.ClientBase.startServer(ClientBase.java:535)
	at org.apache.zookeeper.test.ClientBase.setUp(ClientBase.java:518)


FAILED:  org.apache.zookeeper.test.ClientTest.testSequentialNodeData

Error Message:
Unexpected bean exists! expected:<0> but was:<36>

Stack Trace:
junit.framework.AssertionFailedError: Unexpected bean exists! expected:<0> but was:<36>
	at org.apache.zookeeper.test.ClientBase.verifyUnexpectedBeans(ClientBase.java:556)
	at org.apache.zookeeper.test.ClientBase.startServer(ClientBase.java:535)
	at org.apache.zookeeper.test.ClientBase.setUp(ClientBase.java:518)


FAILED:  org.apache.zookeeper.test.ClientTest.testSequentialNodeNames

Error Message:
Unexpected bean exists! expected:<0> but was:<36>

Stack Trace:
junit.framework.AssertionFailedError: Unexpected bean exists! expected:<0> but was:<36>
	at org.apache.zookeeper.test.ClientBase.verifyUnexpectedBeans(ClientBase.java:556)
	at org.apache.zookeeper.test.ClientBase.startServer(ClientBase.java:535)
	at org.apache.zookeeper.test.ClientBase.setUp(ClientBase.java:518)


FAILED:  org.apache.zookeeper.test.ClientTest.testClientWithWatcherObj

Error Message:
Unexpected bean exists! expected:<0> but was:<36>

Stack Trace:
junit.framework.AssertionFailedError: Unexpected bean exists! expected:<0> but was:<36>
	at org.apache.zookeeper.test.ClientBase.verifyUnexpectedBeans(ClientBase.java:556)
	at org.apache.zookeeper.test.ClientBase.startServer(ClientBase.java:535)
	at org.apache.zookeeper.test.ClientBase.setUp(ClientBase.java:518)


FAILED:  org.apache.zookeeper.test.ClientTest.testTestability

Error Message:
Unexpected bean exists! expected:<0> but was:<36>

Stack Trace:
junit.framework.AssertionFailedError: Unexpected bean exists! expected:<0> but was:<36>
	at org.apache.zookeeper.test.ClientBase.verifyUnexpectedBeans(ClientBase.java:556)
	at org.apache.zookeeper.test.ClientBase.startServer(ClientBase.java:535)
	at org.apache.zookeeper.test.ClientBase.setUp(ClientBase.java:518)


FAILED:  org.apache.zookeeper.test.ClientTest.testNullAuthId

Error Message:
Unexpected bean exists! expected:<0> but was:<36>

Stack Trace:
junit.framework.AssertionFailedError: Unexpected bean exists! expected:<0> but was:<36>
	at org.apache.zookeeper.test.ClientBase.verifyUnexpectedBeans(ClientBase.java:556)
	at org.apache.zookeeper.test.ClientBase.startServer(ClientBase.java:535)
	at org.apache.zookeeper.test.ClientBase.setUp(ClientBase.java:518)


FAILED:  org.apache.zookeeper.test.ClientTest.testNonExistingOpCode

Error Message:
Unexpected bean exists! expected:<0> but was:<36>

Stack Trace:
junit.framework.AssertionFailedError: Unexpected bean exists! expected:<0> but was:<36>
	at org.apache.zookeeper.test.ClientBase.verifyUnexpectedBeans(ClientBase.java:556)
	at org.apache.zookeeper.test.ClientBase.startServer(ClientBase.java:535)
	at org.apache.zookeeper.test.ClientBase.setUp(ClientBase.java:518)


FAILED:  org.apache.zookeeper.test.ClientTest.testDeleteWithChildren

Error Message:
Unexpected bean exists! expected:<0> but was:<36>

Stack Trace:
junit.framework.AssertionFailedError: Unexpected bean exists! expected:<0> but was:<36>
	at org.apache.zookeeper.test.ClientBase.verifyUnexpectedBeans(ClientBase.java:556)
	at org.apache.zookeeper.test.ClientBase.startServer(ClientBase.java:535)
	at org.apache.zookeeper.test.ClientBase.setUp(ClientBase.java:518)


FAILED:  org.apache.zookeeper.test.ClientTest.testPathValidation

Error Message:
Unexpected bean exists! expected:<0> but was:<36>

Stack Trace:
junit.framework.AssertionFailedError: Unexpected bean exists! expected:<0> but was:<36>
	at org.apache.zookeeper.test.ClientBase.verifyUnexpectedBeans(ClientBase.java:556)
	at org.apache.zookeeper.test.ClientBase.startServer(ClientBase.java:535)
	at org.apache.zookeeper.test.ClientBase.setUp(ClientBase.java:518)


FAILED:  org.apache.zookeeper.test.ClientTest.testLargeNodeData

Error Message:
Unexpected bean exists! expected:<0> but was:<36>

Stack Trace:
junit.framework.AssertionFailedError: Unexpected bean exists! expected:<0> but was:<36>
	at org.apache.zookeeper.test.ClientBase.verifyUnexpectedBeans(ClientBase.java:556)
	at org.apache.zookeeper.test.ClientBase.startServer(ClientBase.java:535)
	at org.apache.zookeeper.test.ClientBase.setUp(ClientBase.java:518)


FAILED:  org.apache.zookeeper.test.ClientTest.testMutipleWatcherObjs

Error Message:
Unexpected bean exists! expected:<0> but was:<36>

Stack Trace:
junit.framework.AssertionFailedError: Unexpected bean exists! expected:<0> but was:<36>
	at org.apache.zookeeper.test.ClientBase.verifyUnexpectedBeans(ClientBase.java:556)
	at org.apache.zookeeper.test.ClientBase.startServer(ClientBase.java:535)
	at org.apache.zookeeper.test.ClientBase.setUp(ClientBase.java:518)


FAILED:  org.apache.zookeeper.test.FourLetterWordsTest.testFourLetterWords

Error Message:
Unexpected bean exists! expected:<0> but was:<36>

Stack Trace:
junit.framework.AssertionFailedError: Unexpected bean exists! expected:<0> but was:<36>
	at org.apache.zookeeper.test.ClientBase.verifyUnexpectedBeans(ClientBase.java:556)
	at org.apache.zookeeper.test.ClientBase.startServer(ClientBase.java:535)
	at org.apache.zookeeper.test.ClientBase.setUp(ClientBase.java:518)
	at java.util.concurrent.FutureTask.run(FutureTask.java:262)
	at java.lang.Thread.run(Thread.java:745)


FAILED:  org.apache.zookeeper.test.FourLetterWordsTest.testSetTraceMask

Error Message:
Unexpected bean exists! expected:<0> but was:<36>

Stack Trace:
junit.framework.AssertionFailedError: Unexpected bean exists! expected:<0> but was:<36>
	at org.apache.zookeeper.test.ClientBase.verifyUnexpectedBeans(ClientBase.java:556)
	at org.apache.zookeeper.test.ClientBase.startServer(ClientBase.java:535)
	at org.apache.zookeeper.test.ClientBase.setUp(ClientBase.java:518)
	at java.util.concurrent.FutureTask.run(FutureTask.java:262)
	at java.lang.Thread.run(Thread.java:745)


FAILED:  org.apache.zookeeper.test.FourLetterWordsTest.testValidateConsOutput

Error Message:
Unexpected bean exists! expected:<0> but was:<36>

Stack Trace:
junit.framework.AssertionFailedError: Unexpected bean exists! expected:<0> but was:<36>
	at org.apache.zookeeper.test.ClientBase.verifyUnexpectedBeans(ClientBase.java:556)
	at org.apache.zookeeper.test.ClientBase.startServer(ClientBase.java:535)
	at org.apache.zookeeper.test.ClientBase.setUp(ClientBase.java:518)
	at java.util.concurrent.FutureTask.run(FutureTask.java:262)
	at java.lang.Thread.run(Thread.java:745)


FAILED:  org.apache.zookeeper.test.FourLetterWordsTest.testValidateSocketTimeout

Error Message:
Unexpected bean exists! expected:<0> but was:<36>

Stack Trace:
junit.framework.AssertionFailedError: Unexpected bean exists! expected:<0> but was:<36>
	at org.apache.zookeeper.test.ClientBase.verifyUnexpectedBeans(ClientBase.java:556)
	at org.apache.zookeeper.test.ClientBase.startServer(ClientBase.java:535)
	at org.apache.zookeeper.test.ClientBase.setUp(ClientBase.java:518)
	at java.util.concurrent.FutureTask.run(FutureTask.java:262)
	at java.lang.Thread.run(Thread.java:745)


FAILED:  org.apache.zookeeper.test.FourLetterWordsTest.testValidateStatOutput

Error Message:
Unexpected bean exists! expected:<0> but was:<36>

Stack Trace:
junit.framework.AssertionFailedError: Unexpected bean exists! expected:<0> but was:<36>
	at org.apache.zookeeper.test.ClientBase.verifyUnexpectedBeans(ClientBase.java:556)
	at org.apache.zookeeper.test.ClientBase.startServer(ClientBase.java:535)
	at org.apache.zookeeper.test.ClientBase.setUp(ClientBase.java:518)
	at java.util.concurrent.FutureTask.run(FutureTask.java:262)
	at java.lang.Thread.run(Thread.java:745)


FAILED:  org.apache.zookeeper.test.NullDataTest.testNullData

Error Message:
Unexpected bean exists! expected:<0> but was:<36>

Stack Trace:
junit.framework.AssertionFailedError: Unexpected bean exists! expected:<0> but was:<36>
	at org.apache.zookeeper.test.ClientBase.verifyUnexpectedBeans(ClientBase.java:556)
	at org.apache.zookeeper.test.ClientBase.startServer(ClientBase.java:535)
	at org.apache.zookeeper.test.ClientBase.setUp(ClientBase.java:518)
	at org.apache.zookeeper.test.NullDataTest.setUp(NullDataTest.java:43)


FAILED:  org.apache.zookeeper.test.WatcherTest.testWatchAutoResetWithPending

Error Message:
Unexpected bean exists! expected:<0> but was:<36>

Stack Trace:
junit.framework.AssertionFailedError: Unexpected bean exists! expected:<0> but was:<36>
	at org.apache.zookeeper.test.ClientBase.verifyUnexpectedBeans(ClientBase.java:556)
	at org.apache.zookeeper.test.ClientBase.startServer(ClientBase.java:535)
	at org.apache.zookeeper.test.ClientBase.setUp(ClientBase.java:518)
	at org.apache.zookeeper.test.WatcherTest.setUp(WatcherTest.java:76)


FAILED:  org.apache.zookeeper.test.WatcherTest.testWatcherCorrectness

Error Message:
Unexpected bean exists! expected:<0> but was:<36>

Stack Trace:
junit.framework.AssertionFailedError: Unexpected bean exists! expected:<0> but was:<36>
	at org.apache.zookeeper.test.ClientBase.verifyUnexpectedBeans(ClientBase.java:556)
	at org.apache.zookeeper.test.ClientBase.startServer(ClientBase.java:535)
	at org.apache.zookeeper.test.ClientBase.setUp(ClientBase.java:518)
	at org.apache.zookeeper.test.WatcherTest.setUp(WatcherTest.java:76)


FAILED:  org.apache.zookeeper.test.WatcherTest.testWatcherAutoResetDisabledWithLocal

Error Message:
Unexpected bean exists! expected:<0> but was:<36>

Stack Trace:
junit.framework.AssertionFailedError: Unexpected bean exists! expected:<0> but was:<36>
	at org.apache.zookeeper.test.ClientBase.verifyUnexpectedBeans(ClientBase.java:556)
	at org.apache.zookeeper.test.ClientBase.startServer(ClientBase.java:535)
	at org.apache.zookeeper.test.ClientBase.setUp(ClientBase.java:518)
	at org.apache.zookeeper.test.WatcherTest.setUp(WatcherTest.java:76)


FAILED:  org.apache.zookeeper.test.WatcherTest.testWatcherAutoResetWithGlobal

Error Message:
Unexpected bean exists! expected:<0> but was:<36>

Stack Trace:
junit.framework.AssertionFailedError: Unexpected bean exists! expected:<0> but was:<36>
	at org.apache.zookeeper.test.ClientBase.verifyUnexpectedBeans(ClientBase.java:556)
	at org.apache.zookeeper.test.ClientBase.startServer(ClientBase.java:535)
	at org.apache.zookeeper.test.ClientBase.setUp(ClientBase.java:518)
	at org.apache.zookeeper.test.WatcherTest.setUp(WatcherTest.java:76)


FAILED:  org.apache.zookeeper.test.WatcherTest.testWatcherCount

Error Message:
Unexpected bean exists! expected:<0> but was:<36>

Stack Trace:
junit.framework.AssertionFailedError: Unexpected bean exists! expected:<0> but was:<36>
	at org.apache.zookeeper.test.ClientBase.verifyUnexpectedBeans(ClientBase.java:556)
	at org.apache.zookeeper.test.ClientBase.startServer(ClientBase.java:535)
	at org.apache.zookeeper.test.ClientBase.setUp(ClientBase.java:518)
	at org.apache.zookeeper.test.WatcherTest.setUp(WatcherTest.java:76)


FAILED:  org.apache.zookeeper.test.WatcherTest.testWatcherAutoResetDisabledWithGlobal

Error Message:
Unexpected bean exists! expected:<0> but was:<36>

Stack Trace:
junit.framework.AssertionFailedError: Unexpected bean exists! expected:<0> but was:<36>
	at org.apache.zookeeper.test.ClientBase.verifyUnexpectedBeans(ClientBase.java:556)
	at org.apache.zookeeper.test.ClientBase.startServer(ClientBase.java:535)
	at org.apache.zookeeper.test.ClientBase.setUp(ClientBase.java:518)
	at org.apache.zookeeper.test.WatcherTest.setUp(WatcherTest.java:76)


FAILED:  org.apache.zookeeper.test.WatcherTest.testWatcherAutoResetWithLocal

Error Message:
Unexpected bean exists! expected:<0> but was:<36>

Stack Trace:
junit.framework.AssertionFailedError: Unexpected bean exists! expected:<0> but was:<36>
	at org.apache.zookeeper.test.ClientBase.verifyUnexpectedBeans(ClientBase.java:556)
	at org.apache.zookeeper.test.ClientBase.startServer(ClientBase.java:535)
	at org.apache.zookeeper.test.ClientBase.setUp(ClientBase.java:518)
	at org.apache.zookeeper.test.WatcherTest.setUp(WatcherTest.java:76)
Mime
  • Unnamed multipart/mixed (inline, None, 0 bytes)
View raw message