zookeeper-dev mailing list archives

Site index · List index
Message view « Date » · « Thread »
Top « Date » · « Thread »
From Apache Jenkins Server <jenk...@builds.apache.org>
Subject ZooKeeper_branch35_jdk8 - Build # 613 - Still Failing
Date Thu, 27 Jul 2017 02:32:43 GMT
See https://builds.apache.org/job/ZooKeeper_branch35_jdk8/613/

###################################################################################
########################## LAST 60 LINES OF THE CONSOLE ###########################
[...truncated 66.61 MB...]
    [junit] 2017-07-27 02:32:37,443 [myid:127.0.0.1:16657] - WARN  [main-SendThread(127.0.0.1:16657):ClientCnxn$SendThread@1235]
- Session 0x106c7aca1960001 for server 127.0.0.1/127.0.0.1:16657, unexpected error, closing
socket connection and attempting reconnect
    [junit] java.net.ConnectException: Connection refused
    [junit] 	at sun.nio.ch.SocketChannelImpl.checkConnect(Native Method)
    [junit] 	at sun.nio.ch.SocketChannelImpl.finishConnect(SocketChannelImpl.java:717)
    [junit] 	at org.apache.zookeeper.ClientCnxnSocketNIO.doTransport(ClientCnxnSocketNIO.java:357)
    [junit] 	at org.apache.zookeeper.ClientCnxn$SendThread.run(ClientCnxn.java:1214)
    [junit] 2017-07-27 02:32:37,486 [myid:127.0.0.1:16731] - INFO  [main-SendThread(127.0.0.1:16731):ClientCnxn$SendThread@1113]
- Opening socket connection to server 127.0.0.1/127.0.0.1:16731. Will not attempt to authenticate
using SASL (unknown error)
    [junit] 2017-07-27 02:32:37,486 [myid:127.0.0.1:16731] - WARN  [main-SendThread(127.0.0.1:16731):ClientCnxn$SendThread@1235]
- Session 0x106c7af7b100000 for server 127.0.0.1/127.0.0.1:16731, unexpected error, closing
socket connection and attempting reconnect
    [junit] java.net.ConnectException: Connection refused
    [junit] 	at sun.nio.ch.SocketChannelImpl.checkConnect(Native Method)
    [junit] 	at sun.nio.ch.SocketChannelImpl.finishConnect(SocketChannelImpl.java:717)
    [junit] 	at org.apache.zookeeper.ClientCnxnSocketNIO.doTransport(ClientCnxnSocketNIO.java:357)
    [junit] 	at org.apache.zookeeper.ClientCnxn$SendThread.run(ClientCnxn.java:1214)
    [junit] 2017-07-27 02:32:37,789 [myid:] - INFO  [ProcessThread(sid:0 cport:16854)::PrepRequestProcessor@611]
- Processed session termination for sessionid: 0x106c7b29cb20000
    [junit] 2017-07-27 02:32:37,792 [myid:] - INFO  [SyncThread:0:MBeanRegistry@128] - Unregister
MBean [org.apache.ZooKeeperService:name0=StandaloneServer_port16854,name1=Connections,name2=127.0.0.1,name3=0x106c7b29cb20000]
    [junit] 2017-07-27 02:32:37,792 [myid:] - INFO  [main:ZooKeeper@1331] - Session: 0x106c7b29cb20000
closed
    [junit] 2017-07-27 02:32:37,792 [myid:] - INFO  [main-EventThread:ClientCnxn$EventThread@513]
- EventThread shut down for session: 0x106c7b29cb20000
    [junit] 2017-07-27 02:32:37,793 [myid:] - INFO  [main:JUnit4ZKTestRunner$LoggedInvokeMethod@82]
- Memory used 90204
    [junit] 2017-07-27 02:32:37,793 [myid:] - INFO  [main:JUnit4ZKTestRunner$LoggedInvokeMethod@87]
- Number of threads 471
    [junit] 2017-07-27 02:32:37,793 [myid:] - INFO  [main:JUnit4ZKTestRunner$LoggedInvokeMethod@102]
- FINISHED TEST METHOD testWatcherAutoResetWithLocal
    [junit] 2017-07-27 02:32:37,793 [myid:] - INFO  [main:ClientBase@586] - tearDown starting
    [junit] 2017-07-27 02:32:37,793 [myid:] - INFO  [main:ClientBase@556] - STOPPING server
    [junit] 2017-07-27 02:32:37,793 [myid:] - INFO  [main:NettyServerCnxnFactory@464] - shutdown
called 0.0.0.0/0.0.0.0:16854
    [junit] 2017-07-27 02:32:37,794 [myid:] - INFO  [main:ZooKeeperServer@541] - shutting
down
    [junit] 2017-07-27 02:32:37,794 [myid:] - ERROR [main:ZooKeeperServer@505] - ZKShutdownHandler
is not registered, so ZooKeeper server won't take any action on ERROR or SHUTDOWN server state
changes
    [junit] 2017-07-27 02:32:37,794 [myid:] - INFO  [main:SessionTrackerImpl@232] - Shutting
down
    [junit] 2017-07-27 02:32:37,794 [myid:] - INFO  [main:PrepRequestProcessor@1005] - Shutting
down
    [junit] 2017-07-27 02:32:37,794 [myid:] - INFO  [main:SyncRequestProcessor@191] - Shutting
down
    [junit] 2017-07-27 02:32:37,794 [myid:] - INFO  [ProcessThread(sid:0 cport:16854)::PrepRequestProcessor@155]
- PrepRequestProcessor exited loop!
    [junit] 2017-07-27 02:32:37,795 [myid:] - INFO  [SyncThread:0:SyncRequestProcessor@169]
- SyncRequestProcessor exited!
    [junit] 2017-07-27 02:32:37,795 [myid:] - INFO  [main:FinalRequestProcessor@481] - shutdown
of request processor complete
    [junit] 2017-07-27 02:32:37,795 [myid:] - INFO  [main:MBeanRegistry@128] - Unregister
MBean [org.apache.ZooKeeperService:name0=StandaloneServer_port16854,name1=InMemoryDataTree]
    [junit] 2017-07-27 02:32:37,795 [myid:] - INFO  [main:MBeanRegistry@128] - Unregister
MBean [org.apache.ZooKeeperService:name0=StandaloneServer_port16854]
    [junit] 2017-07-27 02:32:37,795 [myid:] - INFO  [main:FourLetterWordMain@85] - connecting
to 127.0.0.1 16854
    [junit] 2017-07-27 02:32:37,796 [myid:] - INFO  [main:JMXEnv@146] - ensureOnly:[]
    [junit] 2017-07-27 02:32:37,800 [myid:] - INFO  [main:ClientBase@611] - fdcount after
test is: 1403 at start it was 1399
    [junit] 2017-07-27 02:32:37,800 [myid:] - INFO  [main:ClientBase@613] - sleeping for 20
secs
    [junit] 2017-07-27 02:32:37,800 [myid:] - INFO  [main:ZKTestCase$1@68] - SUCCEEDED testWatcherAutoResetWithLocal
    [junit] 2017-07-27 02:32:37,800 [myid:] - INFO  [main:ZKTestCase$1@63] - FINISHED testWatcherAutoResetWithLocal
    [junit] Tests run: 103, Failures: 0, Errors: 0, Skipped: 0, Time elapsed: 424.474 sec,
Thread: 3, Class: org.apache.zookeeper.test.NioNettySuiteTest
    [junit] 2017-07-27 02:32:38,134 [myid:127.0.0.1:16734] - INFO  [main-SendThread(127.0.0.1:16734):ClientCnxn$SendThread@1113]
- Opening socket connection to server 127.0.0.1/127.0.0.1:16734. Will not attempt to authenticate
using SASL (unknown error)
    [junit] 2017-07-27 02:32:38,135 [myid:127.0.0.1:16734] - WARN  [main-SendThread(127.0.0.1:16734):ClientCnxn$SendThread@1235]
- Session 0x206c7af7b110000 for server 127.0.0.1/127.0.0.1:16734, unexpected error, closing
socket connection and attempting reconnect
    [junit] java.net.ConnectException: Connection refused
    [junit] 	at sun.nio.ch.SocketChannelImpl.checkConnect(Native Method)
    [junit] 	at sun.nio.ch.SocketChannelImpl.finishConnect(SocketChannelImpl.java:717)
    [junit] 	at org.apache.zookeeper.ClientCnxnSocketNIO.doTransport(ClientCnxnSocketNIO.java:357)
    [junit] 	at org.apache.zookeeper.ClientCnxn$SendThread.run(ClientCnxn.java:1214)

fail.build.on.test.failure:

BUILD FAILED
/home/jenkins/jenkins-slave/workspace/ZooKeeper_branch35_jdk8/build.xml:1225: The following
error occurred while executing this line:
/home/jenkins/jenkins-slave/workspace/ZooKeeper_branch35_jdk8/build.xml:1229: Tests failed!

Total time: 11 minutes 27 seconds
Build step 'Invoke Ant' marked build as failure
Recording test results
Email was triggered for: Failure - Any
Sending email for trigger: Failure - Any



###################################################################################
############################## FAILED TESTS (if any) ##############################
1 tests failed.
FAILED:  org.apache.zookeeper.server.quorum.ReconfigDuringLeaderSyncTest.testDuringLeaderSync

Error Message:
zoo.cfg.dynamic.next is not deleted.

Stack Trace:
junit.framework.AssertionFailedError: zoo.cfg.dynamic.next is not deleted.
	at org.apache.zookeeper.server.quorum.ReconfigDuringLeaderSyncTest.testDuringLeaderSync(ReconfigDuringLeaderSyncTest.java:165)
	at org.apache.zookeeper.JUnit4ZKTestRunner$LoggedInvokeMethod.evaluate(JUnit4ZKTestRunner.java:79)
Mime
  • Unnamed multipart/mixed (inline, None, 0 bytes)
View raw message