zookeeper-dev mailing list archives

Site index · List index
Message view « Date » · « Thread »
Top « Date » · « Thread »
From Apache Jenkins Server <jenk...@builds.apache.org>
Subject ZooKeeper_branch35_openjdk7 - Build # 594 - Failure
Date Sat, 08 Jul 2017 10:07:05 GMT
See https://builds.apache.org/job/ZooKeeper_branch35_openjdk7/594/

###################################################################################
########################## LAST 60 LINES OF THE CONSOLE ###########################
[...truncated 64.85 MB...]
    [junit] 2017-07-08 10:07:00,347 [myid:] - INFO  [ProcessThread(sid:0 cport:11468)::PrepRequestProcessor@611]
- Processed session termination for sessionid: 0x1054b8eccbb0000
    [junit] 2017-07-08 10:07:00,348 [myid:] - INFO  [SyncThread:0:MBeanRegistry@128] - Unregister
MBean [org.apache.ZooKeeperService:name0=StandaloneServer_port11468,name1=Connections,name2=127.0.0.1,name3=0x1054b8eccbb0000]
    [junit] 2017-07-08 10:07:00,348 [myid:] - INFO  [main:ZooKeeper@1331] - Session: 0x1054b8eccbb0000
closed
    [junit] 2017-07-08 10:07:00,348 [myid:] - INFO  [main-EventThread:ClientCnxn$EventThread@513]
- EventThread shut down for session: 0x1054b8eccbb0000
    [junit] 2017-07-08 10:07:00,348 [myid:] - INFO  [main:JUnit4ZKTestRunner$LoggedInvokeMethod@82]
- Memory used 260168
    [junit] 2017-07-08 10:07:00,349 [myid:] - INFO  [main:JUnit4ZKTestRunner$LoggedInvokeMethod@87]
- Number of threads 2431
    [junit] 2017-07-08 10:07:00,349 [myid:] - INFO  [main:JUnit4ZKTestRunner$LoggedInvokeMethod@102]
- FINISHED TEST METHOD testWatcherAutoResetWithLocal
    [junit] 2017-07-08 10:07:00,349 [myid:] - INFO  [main:ClientBase@586] - tearDown starting
    [junit] 2017-07-08 10:07:00,349 [myid:] - INFO  [main:ClientBase@556] - STOPPING server
    [junit] 2017-07-08 10:07:00,349 [myid:] - INFO  [main:NettyServerCnxnFactory@464] - shutdown
called 0.0.0.0/0.0.0.0:11468
    [junit] 2017-07-08 10:07:00,361 [myid:] - INFO  [main:ZooKeeperServer@541] - shutting
down
    [junit] 2017-07-08 10:07:00,362 [myid:] - ERROR [main:ZooKeeperServer@505] - ZKShutdownHandler
is not registered, so ZooKeeper server won't take any action on ERROR or SHUTDOWN server state
changes
    [junit] 2017-07-08 10:07:00,362 [myid:] - INFO  [main:SessionTrackerImpl@232] - Shutting
down
    [junit] 2017-07-08 10:07:00,362 [myid:] - INFO  [main:PrepRequestProcessor@1005] - Shutting
down
    [junit] 2017-07-08 10:07:00,362 [myid:] - INFO  [main:SyncRequestProcessor@191] - Shutting
down
    [junit] 2017-07-08 10:07:00,362 [myid:] - INFO  [ProcessThread(sid:0 cport:11468)::PrepRequestProcessor@155]
- PrepRequestProcessor exited loop!
    [junit] 2017-07-08 10:07:00,362 [myid:] - INFO  [SyncThread:0:SyncRequestProcessor@169]
- SyncRequestProcessor exited!
    [junit] 2017-07-08 10:07:00,363 [myid:] - INFO  [main:FinalRequestProcessor@481] - shutdown
of request processor complete
    [junit] 2017-07-08 10:07:00,363 [myid:] - INFO  [main:MBeanRegistry@128] - Unregister
MBean [org.apache.ZooKeeperService:name0=StandaloneServer_port11468,name1=InMemoryDataTree]
    [junit] 2017-07-08 10:07:00,363 [myid:] - INFO  [main:MBeanRegistry@128] - Unregister
MBean [org.apache.ZooKeeperService:name0=StandaloneServer_port11468]
    [junit] 2017-07-08 10:07:00,364 [myid:] - INFO  [main:FourLetterWordMain@85] - connecting
to 127.0.0.1 11468
    [junit] 2017-07-08 10:07:00,364 [myid:] - INFO  [main:JMXEnv@146] - ensureOnly:[]
    [junit] 2017-07-08 10:07:00,374 [myid:] - INFO  [main:ClientBase@611] - fdcount after
test is: 7143 at start it was 7143
    [junit] 2017-07-08 10:07:00,375 [myid:] - INFO  [main:ZKTestCase$1@68] - SUCCEEDED testWatcherAutoResetWithLocal
    [junit] 2017-07-08 10:07:00,375 [myid:] - INFO  [main:ZKTestCase$1@63] - FINISHED testWatcherAutoResetWithLocal
    [junit] 2017-07-08 10:07:00,376 [myid:127.0.0.1:11351] - INFO  [main-SendThread(127.0.0.1:11351):ClientCnxn$SendThread@1113]
- Opening socket connection to server 127.0.0.1/127.0.0.1:11351. Will not attempt to authenticate
using SASL (unknown error)
    [junit] 2017-07-08 10:07:00,394 [myid:127.0.0.1:11351] - WARN  [main-SendThread(127.0.0.1:11351):ClientCnxn$SendThread@1235]
- Session 0x3054b8b79330000 for server 127.0.0.1/127.0.0.1:11351, unexpected error, closing
socket connection and attempting reconnect
    [junit] java.net.ConnectException: Connection refused
    [junit] 	at sun.nio.ch.SocketChannelImpl.checkConnect(Native Method)
    [junit] 	at sun.nio.ch.SocketChannelImpl.finishConnect(SocketChannelImpl.java:739)
    [junit] 	at org.apache.zookeeper.ClientCnxnSocketNIO.doTransport(ClientCnxnSocketNIO.java:357)
    [junit] 	at org.apache.zookeeper.ClientCnxn$SendThread.run(ClientCnxn.java:1214)
    [junit] Tests run: 103, Failures: 0, Errors: 0, Skipped: 0, Time elapsed: 417.624 sec,
Thread: 1, Class: org.apache.zookeeper.test.NioNettySuiteTest
    [junit] 2017-07-08 10:07:00,613 [myid:127.0.0.1:11222] - INFO  [main-SendThread(127.0.0.1:11222):ClientCnxn$SendThread@1113]
- Opening socket connection to server 127.0.0.1/127.0.0.1:11222. Will not attempt to authenticate
using SASL (unknown error)
    [junit] 2017-07-08 10:07:00,614 [myid:127.0.0.1:11222] - WARN  [main-SendThread(127.0.0.1:11222):ClientCnxn$SendThread@1235]
- Session 0x1054b8887930000 for server 127.0.0.1/127.0.0.1:11222, unexpected error, closing
socket connection and attempting reconnect
    [junit] java.net.ConnectException: Connection refused
    [junit] 	at sun.nio.ch.SocketChannelImpl.checkConnect(Native Method)
    [junit] 	at sun.nio.ch.SocketChannelImpl.finishConnect(SocketChannelImpl.java:739)
    [junit] 	at org.apache.zookeeper.ClientCnxnSocketNIO.doTransport(ClientCnxnSocketNIO.java:357)
    [junit] 	at org.apache.zookeeper.ClientCnxn$SendThread.run(ClientCnxn.java:1214)
    [junit] 2017-07-08 10:07:00,617 [myid:127.0.0.1:11286] - INFO  [main-SendThread(127.0.0.1:11286):ClientCnxn$SendThread@1113]
- Opening socket connection to server 127.0.0.1/127.0.0.1:11286. Will not attempt to authenticate
using SASL (unknown error)
    [junit] 2017-07-08 10:07:00,617 [myid:127.0.0.1:11286] - WARN  [main-SendThread(127.0.0.1:11286):ClientCnxn$SendThread@1235]
- Session 0x1054b892c6e0000 for server 127.0.0.1/127.0.0.1:11286, unexpected error, closing
socket connection and attempting reconnect
    [junit] java.net.ConnectException: Connection refused
    [junit] 	at sun.nio.ch.SocketChannelImpl.checkConnect(Native Method)
    [junit] 	at sun.nio.ch.SocketChannelImpl.finishConnect(SocketChannelImpl.java:739)
    [junit] 	at org.apache.zookeeper.ClientCnxnSocketNIO.doTransport(ClientCnxnSocketNIO.java:357)
    [junit] 	at org.apache.zookeeper.ClientCnxn$SendThread.run(ClientCnxn.java:1214)

fail.build.on.test.failure:

BUILD FAILED
/home/jenkins/jenkins-slave/workspace/ZooKeeper_branch35_openjdk7/build.xml:1219: The following
error occurred while executing this line:
/home/jenkins/jenkins-slave/workspace/ZooKeeper_branch35_openjdk7/build.xml:1223: Tests failed!

Total time: 9 minutes 52 seconds
Build step 'Invoke Ant' marked build as failure
Recording test results
Email was triggered for: Failure - Any
Sending email for trigger: Failure - Any



###################################################################################
############################## FAILED TESTS (if any) ##############################
1 tests failed.
FAILED:  org.apache.zookeeper.server.quorum.ReconfigDuringLeaderSyncTest.testDuringLeaderSync

Error Message:
zoo.cfg.dynamic.next is not deleted.

Stack Trace:
junit.framework.AssertionFailedError: zoo.cfg.dynamic.next is not deleted.
	at org.apache.zookeeper.server.quorum.ReconfigDuringLeaderSyncTest.testDuringLeaderSync(ReconfigDuringLeaderSyncTest.java:165)
	at org.apache.zookeeper.JUnit4ZKTestRunner$LoggedInvokeMethod.evaluate(JUnit4ZKTestRunner.java:79)
Mime
  • Unnamed multipart/mixed (inline, None, 0 bytes)
View raw message