zookeeper-dev mailing list archives

Site index · List index
Message view « Date » · « Thread »
Top « Date » · « Thread »
From Apache Jenkins Server <jenk...@builds.apache.org>
Subject ZooKeeper_branch35_jdk8 - Build # 602 - Still Failing
Date Sun, 16 Jul 2017 19:07:21 GMT
See https://builds.apache.org/job/ZooKeeper_branch35_jdk8/602/

###################################################################################
########################## LAST 60 LINES OF THE CONSOLE ###########################
[...truncated 65.57 MB...]
    [junit] 2017-07-16 19:07:16,978 [myid:127.0.0.1:22058] - INFO  [main-SendThread(127.0.0.1:22058):ClientCnxn$SendThread@1113]
- Opening socket connection to server 127.0.0.1/127.0.0.1:22058. Will not attempt to authenticate
using SASL (unknown error)
    [junit] 2017-07-16 19:07:16,979 [myid:127.0.0.1:22058] - WARN  [main-SendThread(127.0.0.1:22058):ClientCnxn$SendThread@1235]
- Session 0x10692961dde0000 for server 127.0.0.1/127.0.0.1:22058, unexpected error, closing
socket connection and attempting reconnect
    [junit] java.net.ConnectException: Connection refused
    [junit] 	at sun.nio.ch.SocketChannelImpl.checkConnect(Native Method)
    [junit] 	at sun.nio.ch.SocketChannelImpl.finishConnect(SocketChannelImpl.java:717)
    [junit] 	at org.apache.zookeeper.ClientCnxnSocketNIO.doTransport(ClientCnxnSocketNIO.java:357)
    [junit] 	at org.apache.zookeeper.ClientCnxn$SendThread.run(ClientCnxn.java:1214)
    [junit] 2017-07-16 19:07:16,997 [myid:] - INFO  [ProcessThread(sid:0 cport:22240)::PrepRequestProcessor@611]
- Processed session termination for sessionid: 0x106929b46b80000
    [junit] 2017-07-16 19:07:16,998 [myid:] - INFO  [SyncThread:0:MBeanRegistry@128] - Unregister
MBean [org.apache.ZooKeeperService:name0=StandaloneServer_port22240,name1=Connections,name2=127.0.0.1,name3=0x106929b46b80000]
    [junit] 2017-07-16 19:07:16,998 [myid:] - INFO  [main-EventThread:ClientCnxn$EventThread@513]
- EventThread shut down for session: 0x106929b46b80000
    [junit] 2017-07-16 19:07:16,999 [myid:] - INFO  [main:ZooKeeper@1331] - Session: 0x106929b46b80000
closed
    [junit] 2017-07-16 19:07:16,999 [myid:] - INFO  [main:JUnit4ZKTestRunner$LoggedInvokeMethod@82]
- Memory used 71219
    [junit] 2017-07-16 19:07:16,999 [myid:] - INFO  [main:JUnit4ZKTestRunner$LoggedInvokeMethod@87]
- Number of threads 471
    [junit] 2017-07-16 19:07:16,999 [myid:] - INFO  [main:JUnit4ZKTestRunner$LoggedInvokeMethod@102]
- FINISHED TEST METHOD testWatcherAutoResetWithLocal
    [junit] 2017-07-16 19:07:16,999 [myid:] - INFO  [main:ClientBase@586] - tearDown starting
    [junit] 2017-07-16 19:07:16,999 [myid:] - INFO  [main:ClientBase@556] - STOPPING server
    [junit] 2017-07-16 19:07:16,999 [myid:] - INFO  [main:NettyServerCnxnFactory@464] - shutdown
called 0.0.0.0/0.0.0.0:22240
    [junit] 2017-07-16 19:07:17,000 [myid:] - INFO  [main:ZooKeeperServer@541] - shutting
down
    [junit] 2017-07-16 19:07:17,000 [myid:] - ERROR [main:ZooKeeperServer@505] - ZKShutdownHandler
is not registered, so ZooKeeper server won't take any action on ERROR or SHUTDOWN server state
changes
    [junit] 2017-07-16 19:07:17,000 [myid:] - INFO  [main:SessionTrackerImpl@232] - Shutting
down
    [junit] 2017-07-16 19:07:17,001 [myid:] - INFO  [main:PrepRequestProcessor@1005] - Shutting
down
    [junit] 2017-07-16 19:07:17,001 [myid:] - INFO  [main:SyncRequestProcessor@191] - Shutting
down
    [junit] 2017-07-16 19:07:17,001 [myid:] - INFO  [ProcessThread(sid:0 cport:22240)::PrepRequestProcessor@155]
- PrepRequestProcessor exited loop!
    [junit] 2017-07-16 19:07:17,001 [myid:] - INFO  [SyncThread:0:SyncRequestProcessor@169]
- SyncRequestProcessor exited!
    [junit] 2017-07-16 19:07:17,001 [myid:] - INFO  [main:FinalRequestProcessor@481] - shutdown
of request processor complete
    [junit] 2017-07-16 19:07:17,001 [myid:] - INFO  [main:MBeanRegistry@128] - Unregister
MBean [org.apache.ZooKeeperService:name0=StandaloneServer_port22240,name1=InMemoryDataTree]
    [junit] 2017-07-16 19:07:17,001 [myid:] - INFO  [main:MBeanRegistry@128] - Unregister
MBean [org.apache.ZooKeeperService:name0=StandaloneServer_port22240]
    [junit] 2017-07-16 19:07:17,001 [myid:] - INFO  [main:FourLetterWordMain@85] - connecting
to 127.0.0.1 22240
    [junit] 2017-07-16 19:07:17,002 [myid:] - INFO  [main:JMXEnv@146] - ensureOnly:[]
    [junit] 2017-07-16 19:07:17,005 [myid:] - INFO  [main:ClientBase@611] - fdcount after
test is: 1392 at start it was 1392
    [junit] 2017-07-16 19:07:17,005 [myid:] - INFO  [main:ZKTestCase$1@68] - SUCCEEDED testWatcherAutoResetWithLocal
    [junit] 2017-07-16 19:07:17,006 [myid:] - INFO  [main:ZKTestCase$1@63] - FINISHED testWatcherAutoResetWithLocal
    [junit] Tests run: 103, Failures: 0, Errors: 0, Skipped: 0, Time elapsed: 391.93 sec,
Thread: 5, Class: org.apache.zookeeper.test.NioNettySuiteTest
    [junit] 2017-07-16 19:07:17,256 [myid:127.0.0.1:22043] - INFO  [main-SendThread(127.0.0.1:22043):ClientCnxn$SendThread@1113]
- Opening socket connection to server 127.0.0.1/127.0.0.1:22043. Will not attempt to authenticate
using SASL (unknown error)
    [junit] 2017-07-16 19:07:17,257 [myid:127.0.0.1:22043] - WARN  [main-SendThread(127.0.0.1:22043):ClientCnxn$SendThread@1235]
- Session 0x1069295be3d0001 for server 127.0.0.1/127.0.0.1:22043, unexpected error, closing
socket connection and attempting reconnect
    [junit] java.net.ConnectException: Connection refused
    [junit] 	at sun.nio.ch.SocketChannelImpl.checkConnect(Native Method)
    [junit] 	at sun.nio.ch.SocketChannelImpl.finishConnect(SocketChannelImpl.java:717)
    [junit] 	at org.apache.zookeeper.ClientCnxnSocketNIO.doTransport(ClientCnxnSocketNIO.java:357)
    [junit] 	at org.apache.zookeeper.ClientCnxn$SendThread.run(ClientCnxn.java:1214)
    [junit] 2017-07-16 19:07:17,341 [myid:127.0.0.1:22120] - INFO  [main-SendThread(127.0.0.1:22120):ClientCnxn$SendThread@1113]
- Opening socket connection to server 127.0.0.1/127.0.0.1:22120. Will not attempt to authenticate
using SASL (unknown error)
    [junit] 2017-07-16 19:07:17,341 [myid:127.0.0.1:22120] - WARN  [main-SendThread(127.0.0.1:22120):ClientCnxn$SendThread@1235]
- Session 0x2069298467b0000 for server 127.0.0.1/127.0.0.1:22120, unexpected error, closing
socket connection and attempting reconnect
    [junit] java.net.ConnectException: Connection refused
    [junit] 	at sun.nio.ch.SocketChannelImpl.checkConnect(Native Method)
    [junit] 	at sun.nio.ch.SocketChannelImpl.finishConnect(SocketChannelImpl.java:717)
    [junit] 	at org.apache.zookeeper.ClientCnxnSocketNIO.doTransport(ClientCnxnSocketNIO.java:357)
    [junit] 	at org.apache.zookeeper.ClientCnxn$SendThread.run(ClientCnxn.java:1214)

fail.build.on.test.failure:

BUILD FAILED
/home/jenkins/jenkins-slave/workspace/ZooKeeper_branch35_jdk8/build.xml:1219: The following
error occurred while executing this line:
/home/jenkins/jenkins-slave/workspace/ZooKeeper_branch35_jdk8/build.xml:1223: Tests failed!

Total time: 10 minutes 14 seconds
Build step 'Invoke Ant' marked build as failure
Recording test results
Email was triggered for: Failure - Any
Sending email for trigger: Failure - Any



###################################################################################
############################## FAILED TESTS (if any) ##############################
3 tests failed.
FAILED:  org.apache.zookeeper.server.quorum.ReconfigDuringLeaderSyncTest.testDuringLeaderSync

Error Message:
zoo.cfg.dynamic.next is not deleted.

Stack Trace:
junit.framework.AssertionFailedError: zoo.cfg.dynamic.next is not deleted.
	at org.apache.zookeeper.server.quorum.ReconfigDuringLeaderSyncTest.testDuringLeaderSync(ReconfigDuringLeaderSyncTest.java:165)
	at org.apache.zookeeper.JUnit4ZKTestRunner$LoggedInvokeMethod.evaluate(JUnit4ZKTestRunner.java:79)


FAILED:  org.apache.zookeeper.test.ChrootClientTest.testNonExistingOpCode

Error Message:
expected:<-4> but was:<-6>

Stack Trace:
junit.framework.AssertionFailedError: expected:<-4> but was:<-6>
	at org.apache.zookeeper.test.ClientTest.testNonExistingOpCode(ClientTest.java:853)
	at org.apache.zookeeper.JUnit4ZKTestRunner$LoggedInvokeMethod.evaluate(JUnit4ZKTestRunner.java:79)


FAILED:  org.apache.zookeeper.test.ClientTest.testNonExistingOpCode

Error Message:
expected:<-4> but was:<-6>

Stack Trace:
junit.framework.AssertionFailedError: expected:<-4> but was:<-6>
	at org.apache.zookeeper.test.ClientTest.testNonExistingOpCode(ClientTest.java:853)
	at org.apache.zookeeper.JUnit4ZKTestRunner$LoggedInvokeMethod.evaluate(JUnit4ZKTestRunner.java:79)
Mime
  • Unnamed multipart/mixed (inline, None, 0 bytes)
View raw message