zookeeper-dev mailing list archives

Site index · List index
Message view « Date » · « Thread »
Top « Date » · « Thread »
From Apache Jenkins Server <jenk...@builds.apache.org>
Subject ZooKeeper_branch34_jdk8 - Build # 1034 - Failure
Date Sat, 17 Jun 2017 23:07:02 GMT
See https://builds.apache.org/job/ZooKeeper_branch34_jdk8/1034/

###################################################################################
########################## LAST 60 LINES OF THE CONSOLE ###########################
[...truncated 31.63 MB...]
    [junit] 2017-06-17 23:06:59,129 [myid:] - INFO  [main:PrepRequestProcessor@769] - Shutting
down
    [junit] 2017-06-17 23:06:59,129 [myid:] - INFO  [main:SyncRequestProcessor@208] - Shutting
down
    [junit] 2017-06-17 23:06:59,129 [myid:] - INFO  [ProcessThread(sid:0 cport:11221)::PrepRequestProcessor@144]
- PrepRequestProcessor exited loop!
    [junit] 2017-06-17 23:06:59,129 [myid:] - INFO  [SyncThread:0:SyncRequestProcessor@186]
- SyncRequestProcessor exited!
    [junit] 2017-06-17 23:06:59,130 [myid:] - INFO  [main:FinalRequestProcessor@403] - shutdown
of request processor complete
    [junit] 2017-06-17 23:06:59,130 [myid:] - INFO  [main:FourLetterWordMain@62] - connecting
to 127.0.0.1 11221
    [junit] 2017-06-17 23:06:59,131 [myid:] - INFO  [main:JMXEnv@147] - ensureOnly:[]
    [junit] 2017-06-17 23:06:59,132 [myid:] - INFO  [main:ClientBase@489] - STARTING server
    [junit] 2017-06-17 23:06:59,133 [myid:] - INFO  [main:ClientBase@410] - CREATING server
instance 127.0.0.1:11221
    [junit] 2017-06-17 23:06:59,133 [myid:] - INFO  [main:ServerCnxnFactory@111] - Using org.apache.zookeeper.server.NIOServerCnxnFactory
as server connection factory
    [junit] 2017-06-17 23:06:59,133 [myid:] - INFO  [main:NIOServerCnxnFactory@89] - binding
to port 0.0.0.0/0.0.0.0:11221
    [junit] 2017-06-17 23:06:59,134 [myid:] - INFO  [main:ClientBase@385] - STARTING server
instance 127.0.0.1:11221
    [junit] 2017-06-17 23:06:59,134 [myid:] - INFO  [main:ZooKeeperServer@173] - Created server
with tickTime 3000 minSessionTimeout 6000 maxSessionTimeout 60000 datadir /home/jenkins/jenkins-slave/workspace/ZooKeeper_branch34_jdk8/build/test/tmp/test4827335499054347379.junit.dir/version-2
snapdir /home/jenkins/jenkins-slave/workspace/ZooKeeper_branch34_jdk8/build/test/tmp/test4827335499054347379.junit.dir/version-2
    [junit] 2017-06-17 23:06:59,137 [myid:] - ERROR [main:ZooKeeperServer@468] - ZKShutdownHandler
is not registered, so ZooKeeper server won't take any action on ERROR or SHUTDOWN server state
changes
    [junit] 2017-06-17 23:06:59,137 [myid:] - INFO  [main:FourLetterWordMain@62] - connecting
to 127.0.0.1 11221
    [junit] 2017-06-17 23:06:59,138 [myid:] - INFO  [NIOServerCxn.Factory:0.0.0.0/0.0.0.0:11221:NIOServerCnxnFactory@192]
- Accepted socket connection from /127.0.0.1:53362
    [junit] 2017-06-17 23:06:59,138 [myid:] - INFO  [NIOServerCxn.Factory:0.0.0.0/0.0.0.0:11221:NIOServerCnxn@883]
- Processing stat command from /127.0.0.1:53362
    [junit] 2017-06-17 23:06:59,139 [myid:] - INFO  [Thread-4:NIOServerCnxn$StatCommand@674]
- Stat command output
    [junit] 2017-06-17 23:06:59,139 [myid:] - INFO  [Thread-4:NIOServerCnxn@1044] - Closed
socket connection for client /127.0.0.1:53362 (no session established for client)
    [junit] 2017-06-17 23:06:59,139 [myid:] - INFO  [main:JMXEnv@230] - ensureParent:[InMemoryDataTree,
StandaloneServer_port]
    [junit] 2017-06-17 23:06:59,141 [myid:] - INFO  [main:JMXEnv@247] - expect:InMemoryDataTree
    [junit] 2017-06-17 23:06:59,142 [myid:] - INFO  [main:JMXEnv@251] - found:InMemoryDataTree
org.apache.ZooKeeperService:name0=StandaloneServer_port11221,name1=InMemoryDataTree
    [junit] 2017-06-17 23:06:59,142 [myid:] - INFO  [main:JMXEnv@247] - expect:StandaloneServer_port
    [junit] 2017-06-17 23:06:59,142 [myid:] - INFO  [main:JMXEnv@251] - found:StandaloneServer_port
org.apache.ZooKeeperService:name0=StandaloneServer_port11221
    [junit] 2017-06-17 23:06:59,143 [myid:] - INFO  [main:JUnit4ZKTestRunner$LoggedInvokeMethod@58]
- Memory used 35529
    [junit] 2017-06-17 23:06:59,143 [myid:] - INFO  [main:JUnit4ZKTestRunner$LoggedInvokeMethod@63]
- Number of threads 20
    [junit] 2017-06-17 23:06:59,143 [myid:] - INFO  [main:JUnit4ZKTestRunner$LoggedInvokeMethod@78]
- FINISHED TEST METHOD testQuota
    [junit] 2017-06-17 23:06:59,143 [myid:] - INFO  [main:ClientBase@566] - tearDown starting
    [junit] 2017-06-17 23:06:59,213 [myid:] - INFO  [main:ZooKeeper@684] - Session: 0x1010fb4af3f0000
closed
    [junit] 2017-06-17 23:06:59,213 [myid:] - INFO  [main-EventThread:ClientCnxn$EventThread@520]
- EventThread shut down for session: 0x1010fb4af3f0000
    [junit] 2017-06-17 23:06:59,213 [myid:] - INFO  [main:ClientBase@536] - STOPPING server
    [junit] 2017-06-17 23:06:59,214 [myid:] - INFO  [NIOServerCxn.Factory:0.0.0.0/0.0.0.0:11221:NIOServerCnxnFactory@219]
- NIOServerCnxn factory exited run method
    [junit] 2017-06-17 23:06:59,214 [myid:] - INFO  [main:ZooKeeperServer@501] - shutting
down
    [junit] 2017-06-17 23:06:59,214 [myid:] - ERROR [main:ZooKeeperServer@468] - ZKShutdownHandler
is not registered, so ZooKeeper server won't take any action on ERROR or SHUTDOWN server state
changes
    [junit] 2017-06-17 23:06:59,214 [myid:] - INFO  [main:SessionTrackerImpl@226] - Shutting
down
    [junit] 2017-06-17 23:06:59,214 [myid:] - INFO  [main:PrepRequestProcessor@769] - Shutting
down
    [junit] 2017-06-17 23:06:59,215 [myid:] - INFO  [main:SyncRequestProcessor@208] - Shutting
down
    [junit] 2017-06-17 23:06:59,215 [myid:] - INFO  [ProcessThread(sid:0 cport:11221)::PrepRequestProcessor@144]
- PrepRequestProcessor exited loop!
    [junit] 2017-06-17 23:06:59,215 [myid:] - INFO  [SyncThread:0:SyncRequestProcessor@186]
- SyncRequestProcessor exited!
    [junit] 2017-06-17 23:06:59,216 [myid:] - INFO  [main:FinalRequestProcessor@403] - shutdown
of request processor complete
    [junit] 2017-06-17 23:06:59,216 [myid:] - INFO  [main:FourLetterWordMain@62] - connecting
to 127.0.0.1 11221
    [junit] 2017-06-17 23:06:59,217 [myid:] - INFO  [main:JMXEnv@147] - ensureOnly:[]
    [junit] 2017-06-17 23:06:59,221 [myid:] - INFO  [main:ClientBase@591] - fdcount after
test is: 98 at start it was 80
    [junit] 2017-06-17 23:06:59,221 [myid:] - INFO  [main:ClientBase@593] - sleeping for 20
secs
    [junit] 2017-06-17 23:06:59,222 [myid:] - INFO  [main:ZKTestCase$1@69] - SUCCEEDED testQuota
    [junit] 2017-06-17 23:06:59,222 [myid:] - INFO  [main:ZKTestCase$1@64] - FINISHED testQuota
    [junit] Tests run: 1, Failures: 0, Errors: 0, Skipped: 0, Time elapsed: 0.727 sec

fail.build.on.test.failure:

BUILD FAILED
/home/jenkins/jenkins-slave/workspace/ZooKeeper_branch34_jdk8/build.xml:1330: The following
error occurred while executing this line:
/home/jenkins/jenkins-slave/workspace/ZooKeeper_branch34_jdk8/build.xml:1333: Tests failed!

Total time: 37 minutes 53 seconds
Build step 'Invoke Ant' marked build as failure
Recording test results
Email was triggered for: Failure - Any
Sending email for trigger: Failure - Any



###################################################################################
############################## FAILED TESTS (if any) ##############################
1 tests failed.
FAILED:  org.apache.zookeeper.test.FollowerTest.testNoLogBeforeLeaderEstablishment

Error Message:
Not following

Stack Trace:
junit.framework.AssertionFailedError: Not following
	at org.apache.zookeeper.test.FollowerTest.testNoLogBeforeLeaderEstablishment(FollowerTest.java:181)
	at org.apache.zookeeper.JUnit4ZKTestRunner$LoggedInvokeMethod.evaluate(JUnit4ZKTestRunner.java:55)
Mime
  • Unnamed multipart/mixed (inline, None, 0 bytes)
View raw message