zookeeper-dev mailing list archives

Site index · List index
Message view « Date » · « Thread »
Top « Date » · « Thread »
From Apache Jenkins Server <jenk...@builds.apache.org>
Subject ZooKeeper_branch35_openjdk7 - Build # 566 - Failure
Date Fri, 16 Jun 2017 01:15:29 GMT
See https://builds.apache.org/job/ZooKeeper_branch35_openjdk7/566/

###################################################################################
########################## LAST 60 LINES OF THE CONSOLE ###########################
[...truncated 124.76 KB...]
    [junit] 2017-06-16 01:15:26,088 [myid:] - INFO  [NIOWorkerThread-1:NIOServerCnxn@627]
- Closed socket connection for client /127.0.0.1:45150 (no session established for client)
    [junit] 2017-06-16 01:15:26,089 [myid:] - INFO  [main:JMXEnv@228] - ensureParent:[InMemoryDataTree,
StandaloneServer_port]
    [junit] 2017-06-16 01:15:26,090 [myid:] - INFO  [main:JMXEnv@245] - expect:InMemoryDataTree
    [junit] 2017-06-16 01:15:26,090 [myid:] - INFO  [main:JMXEnv@249] - found:InMemoryDataTree
org.apache.ZooKeeperService:name0=StandaloneServer_port30079,name1=InMemoryDataTree
    [junit] 2017-06-16 01:15:26,090 [myid:] - INFO  [main:JMXEnv@245] - expect:StandaloneServer_port
    [junit] 2017-06-16 01:15:26,090 [myid:] - INFO  [main:JMXEnv@249] - found:StandaloneServer_port
org.apache.ZooKeeperService:name0=StandaloneServer_port30079
    [junit] 2017-06-16 01:15:26,090 [myid:] - INFO  [main:ClientBase@505] - Client test setup
finished
    [junit] 2017-06-16 01:15:26,091 [myid:] - INFO  [main:ZooKeeper@865] - Initiating client
connection, connectString=127.0.0.1:30079 sessionTimeout=30000 watcher=org.apache.zookeeper.test.ClientBase$CountdownWatcher@1845ac89
    [junit] 2017-06-16 01:15:26,091 [myid:] - INFO  [main:ClientCnxnSocket@236] - jute.maxbuffer
value is 4194304 Bytes
    [junit] 2017-06-16 01:15:26,092 [myid:127.0.0.1:30079] - INFO  [main-SendThread(127.0.0.1:30079):ClientCnxn$SendThread@1113]
- Opening socket connection to server 127.0.0.1/127.0.0.1:30079. Will not attempt to authenticate
using SASL (unknown error)
    [junit] 2017-06-16 01:15:26,092 [myid:] - INFO  [NIOServerCxnFactory.AcceptThread:0.0.0.0/0.0.0.0:30079:NIOServerCnxnFactory$AcceptThread@296]
- Accepted socket connection from /127.0.0.1:45152
    [junit] 2017-06-16 01:15:26,092 [myid:127.0.0.1:30079] - INFO  [main-SendThread(127.0.0.1:30079):ClientCnxn$SendThread@946]
- Socket connection established, initiating session, client: /127.0.0.1:45152, server: 127.0.0.1/127.0.0.1:30079
    [junit] 2017-06-16 01:15:26,093 [myid:] - INFO  [NIOWorkerThread-2:ZooKeeperServer@1020]
- Client attempting to establish new session at /127.0.0.1:45152
    [junit] 2017-06-16 01:15:26,099 [myid:] - INFO  [SyncThread:0:FileTxnLog@206] - Creating
new log file: log.1
    [junit] 2017-06-16 01:15:26,105 [myid:] - INFO  [SyncThread:0:ZooKeeperServer@727] - Established
session 0x1026ad4e85d0000 with negotiated timeout 30000 for client /127.0.0.1:45152
    [junit] 2017-06-16 01:15:26,105 [myid:127.0.0.1:30079] - INFO  [main-SendThread(127.0.0.1:30079):ClientCnxn$SendThread@1381]
- Session establishment complete on server 127.0.0.1/127.0.0.1:30079, sessionid = 0x1026ad4e85d0000,
negotiated timeout = 30000
    [junit] 2017-06-16 01:15:26,106 [myid:] - INFO  [main:JMXEnv@117] - expect:0x1026ad4e85d0000
    [junit] 2017-06-16 01:15:26,107 [myid:] - INFO  [main:JMXEnv@120] - found:0x1026ad4e85d0000
org.apache.ZooKeeperService:name0=StandaloneServer_port30079,name1=Connections,name2=127.0.0.1,name3=0x1026ad4e85d0000
    [junit] 2017-06-16 01:15:26,107 [myid:] - INFO  [Time-limited test:JUnit4ZKTestRunner$LoggedInvokeMethod@77]
- RUNNING TEST METHOD testRemoveNodeChildrenChangedWatches
    [junit] 2017-06-16 01:15:26,113 [myid:] - INFO  [Time-limited test:RemoveWatchesCmdTest@181]
- Adding child changed watcher
    [junit] 2017-06-16 01:15:26,115 [myid:] - INFO  [Time-limited test:RemoveWatchesCmdTest@185]
- Remove watchers using shell command : removewatches /testnode1 -c
    [junit] 2017-06-16 01:15:26,118 [myid:] - INFO  [Time-limited test:JUnit4ZKTestRunner$LoggedInvokeMethod@82]
- Memory used 26448
    [junit] 2017-06-16 01:15:26,118 [myid:] - INFO  [Time-limited test:JUnit4ZKTestRunner$LoggedInvokeMethod@87]
- Number of threads 34
    [junit] 2017-06-16 01:15:26,118 [myid:] - INFO  [Time-limited test:JUnit4ZKTestRunner$LoggedInvokeMethod@102]
- FINISHED TEST METHOD testRemoveNodeChildrenChangedWatches
    [junit] 2017-06-16 01:15:26,119 [myid:] - INFO  [ProcessThread(sid:0 cport:30079)::PrepRequestProcessor@613]
- Processed session termination for sessionid: 0x1026ad4e85d0000
    [junit] 2017-06-16 01:15:26,121 [myid:] - INFO  [NIOWorkerThread-3:MBeanRegistry@128]
- Unregister MBean [org.apache.ZooKeeperService:name0=StandaloneServer_port30079,name1=Connections,name2=127.0.0.1,name3=0x1026ad4e85d0000]
    [junit] 2017-06-16 01:15:26,121 [myid:] - INFO  [main:ZooKeeper@1331] - Session: 0x1026ad4e85d0000
closed
    [junit] 2017-06-16 01:15:26,121 [myid:] - INFO  [main:ClientBase@586] - tearDown starting
    [junit] 2017-06-16 01:15:26,121 [myid:] - INFO  [main:ClientBase@556] - STOPPING server
    [junit] 2017-06-16 01:15:26,121 [myid:] - INFO  [NIOWorkerThread-3:NIOServerCnxn@627]
- Closed socket connection for client /127.0.0.1:45152 which had sessionid 0x1026ad4e85d0000
    [junit] 2017-06-16 01:15:26,121 [myid:] - INFO  [main-EventThread:ClientCnxn$EventThread@513]
- EventThread shut down for session: 0x1026ad4e85d0000
    [junit] 2017-06-16 01:15:26,122 [myid:] - INFO  [ConnnectionExpirer:NIOServerCnxnFactory$ConnectionExpirerThread@583]
- ConnnectionExpirerThread interrupted
    [junit] 2017-06-16 01:15:26,122 [myid:] - INFO  [NIOServerCxnFactory.AcceptThread:0.0.0.0/0.0.0.0:30079:NIOServerCnxnFactory$AcceptThread@219]
- accept thread exitted run method
    [junit] 2017-06-16 01:15:26,123 [myid:] - INFO  [NIOServerCxnFactory.SelectorThread-0:NIOServerCnxnFactory$SelectorThread@420]
- selector thread exitted run method
    [junit] 2017-06-16 01:15:26,123 [myid:] - INFO  [main:ZooKeeperServer@541] - shutting
down
    [junit] 2017-06-16 01:15:26,124 [myid:] - ERROR [main:ZooKeeperServer@505] - ZKShutdownHandler
is not registered, so ZooKeeper server won't take any action on ERROR or SHUTDOWN server state
changes
    [junit] 2017-06-16 01:15:26,124 [myid:] - INFO  [main:SessionTrackerImpl@232] - Shutting
down
    [junit] 2017-06-16 01:15:26,124 [myid:] - INFO  [main:PrepRequestProcessor@1010] - Shutting
down
    [junit] 2017-06-16 01:15:26,124 [myid:] - INFO  [main:SyncRequestProcessor@191] - Shutting
down
    [junit] 2017-06-16 01:15:26,124 [myid:] - INFO  [ProcessThread(sid:0 cport:30079)::PrepRequestProcessor@156]
- PrepRequestProcessor exited loop!
    [junit] 2017-06-16 01:15:26,124 [myid:] - INFO  [SyncThread:0:SyncRequestProcessor@169]
- SyncRequestProcessor exited!
    [junit] 2017-06-16 01:15:26,125 [myid:] - INFO  [main:FinalRequestProcessor@481] - shutdown
of request processor complete
    [junit] 2017-06-16 01:15:26,125 [myid:] - INFO  [main:MBeanRegistry@128] - Unregister
MBean [org.apache.ZooKeeperService:name0=StandaloneServer_port30079,name1=InMemoryDataTree]
    [junit] 2017-06-16 01:15:26,125 [myid:] - INFO  [main:MBeanRegistry@128] - Unregister
MBean [org.apache.ZooKeeperService:name0=StandaloneServer_port30079]
    [junit] 2017-06-16 01:15:26,126 [myid:] - INFO  [main:FourLetterWordMain@85] - connecting
to 127.0.0.1 30079
    [junit] 2017-06-16 01:15:26,127 [myid:] - INFO  [main:JMXEnv@146] - ensureOnly:[]
    [junit] 2017-06-16 01:15:26,131 [myid:] - INFO  [main:ClientBase@611] - fdcount after
test is: 53 at start it was 53
    [junit] 2017-06-16 01:15:26,131 [myid:] - INFO  [main:ZKTestCase$1@68] - SUCCEEDED testRemoveNodeChildrenChangedWatches
    [junit] 2017-06-16 01:15:26,131 [myid:] - INFO  [main:ZKTestCase$1@63] - FINISHED testRemoveNodeChildrenChangedWatches
    [junit] Tests run: 7, Failures: 0, Errors: 0, Skipped: 0, Time elapsed: 4.907 sec, Thread:
8, Class: org.apache.zookeeper.RemoveWatchesCmdTest

BUILD FAILED
/home/jenkins/jenkins-slave/workspace/ZooKeeper_branch35_openjdk7/build.xml:1204: Context
loader has not been reset

Total time: 3 minutes 53 seconds
Build step 'Invoke Ant' marked build as failure
Recording test results
Email was triggered for: Failure - Any
Sending email for trigger: Failure - Any



###################################################################################
############################## FAILED TESTS (if any) ##############################
1 tests failed.
FAILED:  org.apache.zookeeper.CustomHostProviderTest.unknown

Error Message:
Forked Java VM exited abnormally. Please note the time in the report does not reflect the
time until the VM exit.

Stack Trace:
junit.framework.AssertionFailedError: Forked Java VM exited abnormally. Please note the time
in the report does not reflect the time until the VM exit.
	at java.lang.Thread.run(Thread.java:745)
Mime
  • Unnamed multipart/mixed (inline, None, 0 bytes)
View raw message