zookeeper-dev mailing list archives

Site index · List index
Message view « Date » · « Thread »
Top « Date » · « Thread »
From Apache Jenkins Server <jenk...@builds.apache.org>
Subject ZooKeeper-trunk-jdk8 - Build # 1080 - Still Failing
Date Fri, 09 Jun 2017 12:01:10 GMT
See https://builds.apache.org/job/ZooKeeper-trunk-jdk8/1080/

###################################################################################
########################## LAST 60 LINES OF THE CONSOLE ###########################
[...truncated 64.24 MB...]
    [junit] 	at org.apache.zookeeper.ClientCnxn$SendThread.run(ClientCnxn.java:1214)
    [junit] 2017-06-09 12:00:19,505 [myid:127.0.0.1:13915] - INFO  [main-SendThread(127.0.0.1:13915):ClientCnxn$SendThread@1113]
- Opening socket connection to server 127.0.0.1/127.0.0.1:13915. Will not attempt to authenticate
using SASL (unknown error)
    [junit] 2017-06-09 12:00:19,506 [myid:127.0.0.1:13915] - WARN  [main-SendThread(127.0.0.1:13915):ClientCnxn$SendThread@1235]
- Session 0x249091de20001 for server 127.0.0.1/127.0.0.1:13915, unexpected error, closing
socket connection and attempting reconnect
    [junit] java.net.ConnectException: Connection refused
    [junit] 	at sun.nio.ch.SocketChannelImpl.checkConnect(Native Method)
    [junit] 	at sun.nio.ch.SocketChannelImpl.finishConnect(SocketChannelImpl.java:717)
    [junit] 	at org.apache.zookeeper.ClientCnxnSocketNIO.doTransport(ClientCnxnSocketNIO.java:357)
    [junit] 	at org.apache.zookeeper.ClientCnxn$SendThread.run(ClientCnxn.java:1214)
    [junit] 2017-06-09 12:00:19,576 [myid:127.0.0.1:13918] - INFO  [main-SendThread(127.0.0.1:13918):ClientCnxn$SendThread@1113]
- Opening socket connection to server 127.0.0.1/127.0.0.1:13918. Will not attempt to authenticate
using SASL (unknown error)
    [junit] 2017-06-09 12:00:19,577 [myid:127.0.0.1:13918] - WARN  [main-SendThread(127.0.0.1:13918):ClientCnxn$SendThread@1235]
- Session 0x10249091f2f0001 for server 127.0.0.1/127.0.0.1:13918, unexpected error, closing
socket connection and attempting reconnect
    [junit] java.net.ConnectException: Connection refused
    [junit] 	at sun.nio.ch.SocketChannelImpl.checkConnect(Native Method)
    [junit] 	at sun.nio.ch.SocketChannelImpl.finishConnect(SocketChannelImpl.java:717)
    [junit] 	at org.apache.zookeeper.ClientCnxnSocketNIO.doTransport(ClientCnxnSocketNIO.java:357)
    [junit] 	at org.apache.zookeeper.ClientCnxn$SendThread.run(ClientCnxn.java:1214)
    [junit] 2017-06-09 12:00:20,545 [myid:127.0.0.1:13918] - INFO  [main-SendThread(127.0.0.1:13918):ClientCnxn$SendThread@1113]
- Opening socket connection to server 127.0.0.1/127.0.0.1:13918. Will not attempt to authenticate
using SASL (unknown error)
    [junit] 2017-06-09 12:00:20,546 [myid:127.0.0.1:13918] - WARN  [main-SendThread(127.0.0.1:13918):ClientCnxn$SendThread@1235]
- Session 0x10249091f2f0000 for server 127.0.0.1/127.0.0.1:13918, unexpected error, closing
socket connection and attempting reconnect
    [junit] java.net.ConnectException: Connection refused
    [junit] 	at sun.nio.ch.SocketChannelImpl.checkConnect(Native Method)
    [junit] 	at sun.nio.ch.SocketChannelImpl.finishConnect(SocketChannelImpl.java:717)
    [junit] 	at org.apache.zookeeper.ClientCnxnSocketNIO.doTransport(ClientCnxnSocketNIO.java:357)
    [junit] 	at org.apache.zookeeper.ClientCnxn$SendThread.run(ClientCnxn.java:1214)
    [junit] 2017-06-09 12:00:20,906 [myid:127.0.0.1:13915] - INFO  [main-SendThread(127.0.0.1:13915):ClientCnxn$SendThread@1113]
- Opening socket connection to server 127.0.0.1/127.0.0.1:13915. Will not attempt to authenticate
using SASL (unknown error)
    [junit] 2017-06-09 12:00:20,907 [myid:127.0.0.1:13915] - WARN  [main-SendThread(127.0.0.1:13915):ClientCnxn$SendThread@1235]
- Session 0x249091de20000 for server 127.0.0.1/127.0.0.1:13915, unexpected error, closing
socket connection and attempting reconnect
    [junit] java.net.ConnectException: Connection refused
    [junit] 	at sun.nio.ch.SocketChannelImpl.checkConnect(Native Method)
    [junit] 	at sun.nio.ch.SocketChannelImpl.finishConnect(SocketChannelImpl.java:717)
    [junit] 	at org.apache.zookeeper.ClientCnxnSocketNIO.doTransport(ClientCnxnSocketNIO.java:357)
    [junit] 	at org.apache.zookeeper.ClientCnxn$SendThread.run(ClientCnxn.java:1214)
    [junit] 2017-06-09 12:00:21,193 [myid:127.0.0.1:13918] - INFO  [main-SendThread(127.0.0.1:13918):ClientCnxn$SendThread@1113]
- Opening socket connection to server 127.0.0.1/127.0.0.1:13918. Will not attempt to authenticate
using SASL (unknown error)
    [junit] 2017-06-09 12:00:21,194 [myid:127.0.0.1:13918] - WARN  [main-SendThread(127.0.0.1:13918):ClientCnxn$SendThread@1235]
- Session 0x10249091f2f0001 for server 127.0.0.1/127.0.0.1:13918, unexpected error, closing
socket connection and attempting reconnect
    [junit] java.net.ConnectException: Connection refused
    [junit] 	at sun.nio.ch.SocketChannelImpl.checkConnect(Native Method)
    [junit] 	at sun.nio.ch.SocketChannelImpl.finishConnect(SocketChannelImpl.java:717)
    [junit] 	at org.apache.zookeeper.ClientCnxnSocketNIO.doTransport(ClientCnxnSocketNIO.java:357)
    [junit] 	at org.apache.zookeeper.ClientCnxn$SendThread.run(ClientCnxn.java:1214)
    [junit] 2017-06-09 12:00:21,356 [myid:127.0.0.1:13915] - INFO  [main-SendThread(127.0.0.1:13915):ClientCnxn$SendThread@1113]
- Opening socket connection to server 127.0.0.1/127.0.0.1:13915. Will not attempt to authenticate
using SASL (unknown error)
    [junit] 2017-06-09 12:00:21,357 [myid:127.0.0.1:13915] - WARN  [main-SendThread(127.0.0.1:13915):ClientCnxn$SendThread@1235]
- Session 0x249091de20001 for server 127.0.0.1/127.0.0.1:13915, unexpected error, closing
socket connection and attempting reconnect
    [junit] java.net.ConnectException: Connection refused
    [junit] 	at sun.nio.ch.SocketChannelImpl.checkConnect(Native Method)
    [junit] 	at sun.nio.ch.SocketChannelImpl.finishConnect(SocketChannelImpl.java:717)
    [junit] 	at org.apache.zookeeper.ClientCnxnSocketNIO.doTransport(ClientCnxnSocketNIO.java:357)
    [junit] 	at org.apache.zookeeper.ClientCnxn$SendThread.run(ClientCnxn.java:1214)
    [junit] Running org.apache.zookeeper.server.quorum.StandaloneDisabledTest in thread 2
    [junit] Tests run: 1, Failures: 0, Errors: 1, Skipped: 0, Time elapsed: 0 sec, Thread:
2, Class: org.apache.zookeeper.server.quorum.StandaloneDisabledTest
    [junit] Test org.apache.zookeeper.server.quorum.StandaloneDisabledTest FAILED (timeout)

fail.build.on.test.failure:

BUILD FAILED
/home/jenkins/jenkins-slave/workspace/ZooKeeper-trunk-jdk8/build.xml:1219: The following error
occurred while executing this line:
/home/jenkins/jenkins-slave/workspace/ZooKeeper-trunk-jdk8/build.xml:1223: Tests failed!

Total time: 16 minutes 7 seconds
Build step 'Invoke Ant' marked build as failure
[WARNINGS] Skipping publisher since build result is FAILURE
Recording test results
Email was triggered for: Failure - Any
Sending email for trigger: Failure - Any



###################################################################################
############################## FAILED TESTS (if any) ##############################
2 tests failed.
FAILED:  org.apache.zookeeper.test.WatchEventWhenAutoResetTest.testNodeDataChanged

Error Message:
expected:<NodeDataChanged> but was:<NodeDeleted>

Stack Trace:
junit.framework.AssertionFailedError: expected:<NodeDataChanged> but was:<NodeDeleted>
	at org.apache.zookeeper.test.WatchEventWhenAutoResetTest$EventsWatcher.assertEvent(WatchEventWhenAutoResetTest.java:67)
	at org.apache.zookeeper.test.WatchEventWhenAutoResetTest.testNodeDataChanged(WatchEventWhenAutoResetTest.java:117)
	at org.apache.zookeeper.JUnit4ZKTestRunner$LoggedInvokeMethod.evaluate(JUnit4ZKTestRunner.java:79)


FAILED:  org.apache.zookeeper.server.quorum.StandaloneDisabledTest.startSingleServerTest

Error Message:
Timeout occurred. Please note the time in the report does not reflect the time until the timeout.

Stack Trace:
junit.framework.AssertionFailedError: Timeout occurred. Please note the time in the report
does not reflect the time until the timeout.
	at java.lang.Thread.run(Thread.java:745)
Mime
  • Unnamed multipart/mixed (inline, None, 0 bytes)
View raw message