zookeeper-dev mailing list archives

Site index · List index
Message view « Date » · « Thread »
Top « Date » · « Thread »
From Apache Jenkins Server <jenk...@builds.apache.org>
Subject ZooKeeper-trunk-openjdk7 - Build # 1499 - Still Failing
Date Wed, 07 Jun 2017 20:49:08 GMT
See https://builds.apache.org/job/ZooKeeper-trunk-openjdk7/1499/

###################################################################################
########################## LAST 60 LINES OF THE CONSOLE ###########################
[...truncated 12.77 MB...]
    [junit] 	at java.net.AbstractPlainSocketImpl.connectToAddress(AbstractPlainSocketImpl.java:200)
    [junit] 	at java.net.AbstractPlainSocketImpl.connect(AbstractPlainSocketImpl.java:182)
    [junit] 	at java.net.SocksSocketImpl.connect(SocksSocketImpl.java:392)
    [junit] 	at java.net.Socket.connect(Socket.java:579)
    [junit] 	at org.apache.zookeeper.server.quorum.QuorumCnxManager.connectOne(QuorumCnxManager.java:438)
    [junit] 	at org.apache.zookeeper.server.quorum.QuorumCnxManager.connectOne(QuorumCnxManager.java:481)
    [junit] 	at org.apache.zookeeper.server.quorum.QuorumCnxManager.toSend(QuorumCnxManager.java:416)
    [junit] 	at org.apache.zookeeper.server.quorum.FastLeaderElection$Messenger$WorkerSender.process(FastLeaderElection.java:486)
    [junit] 	at org.apache.zookeeper.server.quorum.FastLeaderElection$Messenger$WorkerSender.run(FastLeaderElection.java:465)
    [junit] 	at java.lang.Thread.run(Thread.java:745)
    [junit] 2017-06-07 20:37:37,156 [myid:2] - INFO  [WorkerReceiver[myid=2]:FastLeaderElection@688]
- Notification: 2 (message format version), 2 (n.leader), 0x100000011 (n.zxid), 0x0 (n.round),
LOOKING (n.state), 2 (n.sid), 0x1 (n.peerEPoch), LOOKING (my state)200000000 (n.config version)
    [junit] 2017-06-07 20:37:37,237 [myid:1] - INFO  [WorkerSender[myid=1]:FastLeaderElection$Messenger$WorkerSender@470]
- WorkerSender is down
    [junit] 2017-06-07 20:37:37,238 [myid:0] - INFO  [WorkerSender[myid=0]:FastLeaderElection$Messenger$WorkerSender@470]
- WorkerSender is down
    [junit] 2017-06-07 20:37:37,238 [myid:1] - INFO  [WorkerReceiver[myid=1]:FastLeaderElection$Messenger$WorkerReceiver@440]
- WorkerReceiver is down
    [junit] 2017-06-07 20:37:37,238 [myid:0] - INFO  [WorkerReceiver[myid=0]:FastLeaderElection$Messenger$WorkerReceiver@440]
- WorkerReceiver is down
    [junit] 2017-06-07 20:37:37,243 [myid:] - INFO  [main:ZooKeeper@1329] - Session: 0x104af3a91910000
closed
    [junit] 2017-06-07 20:37:37,243 [myid:] - INFO  [main:QuorumBase@394] - Shutting down
quorum peer QuorumPeer[myid=2](plain=/127.0.0.1:27461)(secure=disabled)
    [junit] 2017-06-07 20:37:37,243 [myid:] - INFO  [main-EventThread:ClientCnxn$EventThread@513]
- EventThread shut down for session: 0x104af3a91910000
    [junit] 2017-06-07 20:37:37,244 [myid:2] - INFO  [ConnnectionExpirer:NIOServerCnxnFactory$ConnectionExpirerThread@583]
- ConnnectionExpirerThread interrupted
    [junit] 2017-06-07 20:37:37,245 [myid:2] - INFO  [NIOServerCxnFactory.SelectorThread-1:NIOServerCnxnFactory$SelectorThread@420]
- selector thread exitted run method
    [junit] 2017-06-07 20:37:37,245 [myid:2] - INFO  [NIOServerCxnFactory.SelectorThread-2:NIOServerCnxnFactory$SelectorThread@420]
- selector thread exitted run method
    [junit] 2017-06-07 20:37:37,245 [myid:2] - INFO  [NIOServerCxnFactory.AcceptThread:localhost/127.0.0.1:27461:NIOServerCnxnFactory$AcceptThread@219]
- accept thread exitted run method
    [junit] 2017-06-07 20:37:37,246 [myid:2] - INFO  [NIOServerCxnFactory.SelectorThread-0:NIOServerCnxnFactory$SelectorThread@420]
- selector thread exitted run method
    [junit] 2017-06-07 20:37:37,246 [myid:2] - INFO  [QuorumPeer[myid=2](plain=/127.0.0.1:27461)(secure=disabled):MBeanRegistry@128]
- Unregister MBean [org.apache.ZooKeeperService:name0=ReplicatedServer_id2,name1=replica.2,name2=LeaderElection]
    [junit] 2017-06-07 20:37:37,246 [myid:2] - INFO  [localhost/127.0.0.1:27463:QuorumCnxManager$Listener@660]
- Leaving listener
    [junit] 2017-06-07 20:37:37,247 [myid:2] - WARN  [QuorumPeer[myid=2](plain=/127.0.0.1:27461)(secure=disabled):QuorumPeer@1092]
- Unexpected exception
    [junit] java.lang.InterruptedException
    [junit] 	at java.util.concurrent.locks.AbstractQueuedSynchronizer$ConditionObject.reportInterruptAfterWait(AbstractQueuedSynchronizer.java:2017)
    [junit] 	at java.util.concurrent.locks.AbstractQueuedSynchronizer$ConditionObject.awaitNanos(AbstractQueuedSynchronizer.java:2095)
    [junit] 	at java.util.concurrent.LinkedBlockingQueue.poll(LinkedBlockingQueue.java:467)
    [junit] 	at org.apache.zookeeper.server.quorum.FastLeaderElection.lookForLeader(FastLeaderElection.java:908)
    [junit] 	at org.apache.zookeeper.server.quorum.QuorumPeer.run(QuorumPeer.java:1090)
    [junit] 2017-06-07 20:37:37,247 [myid:] - INFO  [main:QuorumBase@398] - Shutting down
leader election QuorumPeer[myid=2](plain=/127.0.0.1:27461)(secure=disabled)
    [junit] 2017-06-07 20:37:37,247 [myid:2] - WARN  [QuorumPeer[myid=2](plain=/127.0.0.1:27461)(secure=disabled):QuorumPeer@1143]
- QuorumPeer main thread exited
    [junit] 2017-06-07 20:37:37,247 [myid:] - INFO  [main:QuorumBase@403] - Waiting for QuorumPeer[myid=2](plain=/127.0.0.1:27461)(secure=disabled)
to exit thread
    [junit] 2017-06-07 20:37:37,247 [myid:2] - INFO  [QuorumPeer[myid=2](plain=/127.0.0.1:27461)(secure=disabled):MBeanRegistry@128]
- Unregister MBean [org.apache.ZooKeeperService:name0=ReplicatedServer_id2]
    [junit] 2017-06-07 20:37:37,248 [myid:2] - INFO  [QuorumPeer[myid=2](plain=/127.0.0.1:27461)(secure=disabled):MBeanRegistry@128]
- Unregister MBean [org.apache.ZooKeeperService:name0=ReplicatedServer_id2,name1=replica.2]
    [junit] 2017-06-07 20:37:37,248 [myid:2] - INFO  [QuorumPeer[myid=2](plain=/127.0.0.1:27461)(secure=disabled):MBeanRegistry@128]
- Unregister MBean [org.apache.ZooKeeperService:name0=ReplicatedServer_id2,name1=replica.0]
    [junit] 2017-06-07 20:37:37,248 [myid:2] - INFO  [QuorumPeer[myid=2](plain=/127.0.0.1:27461)(secure=disabled):MBeanRegistry@128]
- Unregister MBean [org.apache.ZooKeeperService:name0=ReplicatedServer_id2,name1=replica.1]
    [junit] 2017-06-07 20:37:37,251 [myid:] - INFO  [main:ZooKeeper@1329] - Session: 0x204af3a92930000
closed
    [junit] 2017-06-07 20:37:37,251 [myid:] - INFO  [main-EventThread:ClientCnxn$EventThread@513]
- EventThread shut down for session: 0x204af3a92930000
    [junit] 2017-06-07 20:37:37,251 [myid:] - INFO  [main:JUnit4ZKTestRunner$LoggedInvokeMethod@82]
- Memory used 18731
    [junit] 2017-06-07 20:37:37,252 [myid:] - INFO  [main:JUnit4ZKTestRunner$LoggedInvokeMethod@87]
- Number of threads 14
    [junit] 2017-06-07 20:37:37,252 [myid:] - INFO  [main:JUnit4ZKTestRunner$LoggedInvokeMethod@102]
- FINISHED TEST METHOD testNextConfigCompletion
    [junit] 2017-06-07 20:37:37,252 [myid:] - INFO  [main:ZKTestCase$1@68] - SUCCEEDED testNextConfigCompletion
    [junit] 2017-06-07 20:37:37,252 [myid:] - INFO  [main:ZKTestCase$1@63] - FINISHED testNextConfigCompletion
    [junit] Tests run: 6, Failures: 0, Errors: 0, Skipped: 0, Time elapsed: 187.508 sec, Thread:
7, Class: org.apache.zookeeper.server.quorum.ReconfigRecoveryTest
    [junit] Running org.apache.zookeeper.server.quorum.QuorumRequestPipelineTest in thread
5
    [junit] Tests run: 1, Failures: 0, Errors: 1, Skipped: 0, Time elapsed: 0 sec, Thread:
5, Class: org.apache.zookeeper.server.quorum.QuorumRequestPipelineTest
    [junit] Test org.apache.zookeeper.server.quorum.QuorumRequestPipelineTest FAILED (timeout)

BUILD FAILED
/home/jenkins/jenkins-slave/workspace/ZooKeeper-trunk-openjdk7/build.xml:1204: Unable to write
log file

Total time: 15 minutes 39 seconds
Build step 'Invoke Ant' marked build as failure
Recording test results
Email was triggered for: Failure - Any
Sending email for trigger: Failure - Any



###################################################################################
############################## FAILED TESTS (if any) ##############################
4 tests failed.
FAILED:  TEST-org.apache.zookeeper.server.quorum.QuorumPeerMainTest.xml.[empty]

Error Message:


Stack Trace:
Test report file /home/jenkins/jenkins-slave/workspace/ZooKeeper-trunk-openjdk7/build/test/logs/TEST-org.apache.zookeeper.server.quorum.QuorumPeerMainTest.xml
was length 0

FAILED:  org.apache.zookeeper.server.quorum.QuorumRequestPipelineTest.unknown

Error Message:
Timeout occurred. Please note the time in the report does not reflect the time until the timeout.

Stack Trace:
junit.framework.AssertionFailedError: Timeout occurred. Please note the time in the report
does not reflect the time until the timeout.
	at java.lang.Thread.run(Thread.java:745)


FAILED:  org.apache.zookeeper.server.quorum.ReconfigLegacyTest.testConfigFileBackwardCompatibility

Error Message:
Forked Java VM exited abnormally. Please note the time in the report does not reflect the
time until the VM exit.

Stack Trace:
junit.framework.AssertionFailedError: Forked Java VM exited abnormally. Please note the time
in the report does not reflect the time until the VM exit.
	at java.lang.Thread.run(Thread.java:745)


FAILED:  TEST-org.apache.zookeeper.test.ACLTest.xml.[empty]

Error Message:


Stack Trace:
Test report file /home/jenkins/jenkins-slave/workspace/ZooKeeper-trunk-openjdk7/build/test/logs/TEST-org.apache.zookeeper.test.ACLTest.xml
was length 0
Mime
  • Unnamed multipart/mixed (inline, None, 0 bytes)
View raw message